{"text_format":"1","workbook":"xlsx","n_sheets":12,"sheets":["はじめに（PC）","【参考】交付単価（PC）","様式第1-3号","別紙1 活動計画書","加算措置（みどり加算以外）","加算措置（みどり加算）","別添1 位置図","別添3 位置図","別添4 位置図","【選択肢】","【取組番号早見表】","【活動項目番号表】 "],"not_rendered":{"charts":0,"images":0,"macros":0,"external_links":0,"defined_names":33,"comments":0,"pivot_tables":0},"unopened":[],"bounds":{"document_bytes":16777216,"sheet_cells":100000,"rows_first":2000,"rows_last":500,"rows_between":2000,"halvings":0,"cell_chars":16384,"cell_head_chars":4096},"cells_cut":0,"cells_raw":0,"read":"whole","date_system":"1900"}

{"sheet":"はじめに（PC）","index":0,"n_rows":61,"n_cols":5,"rows_kept":61,"cut":false,"hidden":false,"merged":[[54,1,54,2],[16,245,16,247],[16,248,16,250],[16,251,16,253],[16,254,16,256],[16,158,16,160],[16,161,16,163],[16,164,16,166],[16,167,16,169],[16,224,16,226],[16,191,16,193],[16,194,16,196],[16,197,16,199],[16,200,16,202],[16,203,16,205],[16,206,16,208],[16,209,16,211],[16,170,16,172],[16,242,16,244],[26,3,27,3],[16,119,16,121],[16,122,16,124],[16,125,16,127],[16,128,16,130],[16,53,16,55],[16,56,16,58],[16,20,16,22],[16,23,16,25],[16,26,16,28],[16,257,16,257],[16,227,16,229],[16,230,16,232],[16,233,16,235],[16,236,16,238],[16,239,16,241],[16,188,16,190],[16,131,16,133],[16,134,16,136],[16,212,16,214],[16,215,16,217],[16,137,16,139],[16,140,16,142],[16,143,16,145],[16,146,16,148],[16,218,16,220],[16,221,16,223],[16,173,16,175],[16,176,16,178],[16,59,16,61],[16,62,16,64],[16,149,16,151],[16,152,16,154],[16,185,16,187],[16,8,16,10],[16,11,16,13],[16,14,16,16],[16,17,16,19],[16,29,16,31],[16,32,16,34],[16,35,16,37],[16,101,16,103],[16,104,16,106],[16,107,16,109],[16,110,16,112],[16,113,16,115],[16,116,16,118],[16,155,16,157],[16,38,16,40],[16,41,16,43],[16,44,16,46],[16,47,16,49],[16,50,16,52],[12,200,12,202],[12,113,12,115],[12,116,12,118],[12,119,12,121],[12,122,12,124],[12,125,12,127],[12,128,12,130],[12,155,12,157],[16,98,16,100],[16,179,16,181],[16,182,16,184],[12,164,12,166],[16,65,16,67],[16,68,16,70],[16,71,16,73],[16,74,16,76],[16,77,16,79],[12,131,12,133],[12,134,12,136],[12,158,12,160],[12,161,12,163],[16,80,16,82],[16,83,16,85],[16,86,16,88],[16,89,16,91],[16,92,16,94],[16,95,16,97],[12,65,12,67],[12,68,12,70],[12,71,12,73],[12,74,12,76],[12,77,12,79],[12,80,12,82],[12,83,12,85],[12,107,12,109],[12,59,12,61],[12,62,12,64],[12,194,12,196],[12,197,12,199],[12,110,12,112],[12,230,12,232],[12,233,12,235],[12,242,12,244],[12,245,12,247],[12,137,12,139],[12,140,12,142],[12,143,12,145],[12,146,12,148],[12,149,12,151],[12,152,12,154],[12,182,12,184],[12,185,12,187],[12,188,12,190],[12,191,12,193],[12,203,12,205],[12,206,12,208],[12,209,12,211],[12,212,12,214],[12,215,12,217],[12,38,12,40],[12,86,12,88],[12,89,12,91],[12,257,12,257],[12,236,12,238],[12,239,12,241],[12,254,12,256],[12,167,12,169],[12,170,12,172],[12,173,12,175],[12,176,12,178],[12,179,12,181],[12,41,12,43],[12,44,12,46],[12,47,12,49],[12,50,12,52],[12,53,12,55],[12,56,12,58],[12,248,12,250],[12,251,12,253],[12,218,12,220],[12,221,12,223],[12,224,12,226],[12,227,12,229],[11,77,11,79],[11,80,11,82],[12,92,12,94],[12,95,12,97],[12,98,12,100],[12,101,12,103],[12,104,12,106],[11,98,11,100],[11,101,11,103],[11,83,11,85],[11,86,11,88],[11,89,11,91],[11,92,11,94],[11,95,11,97],[11,161,11,163],[11,164,11,166],[11,104,11,106],[11,107,11,109],[11,110,11,112],[11,113,11,115],[11,116,11,118],[11,119,11,121],[11,140,11,142],[11,143,11,145],[11,146,11,148],[11,128,11,130],[11,131,11,133],[11,134,11,136],[11,137,11,139],[11,149,11,151],[11,152,11,154],[11,155,11,157],[11,158,11,160],[11,122,11,124],[11,125,11,127],[11,233,11,235],[11,236,11,238],[11,257,11,257],[11,239,11,241],[11,242,11,244],[11,245,11,247],[11,248,11,250],[11,251,11,253],[11,254,11,256],[11,221,11,223],[11,224,11,226],[11,227,11,229],[11,230,11,232],[11,194,11,196],[11,197,11,199],[11,200,11,202],[11,203,11,205],[11,167,11,169],[11,170,11,172],[11,173,11,175],[11,176,11,178],[11,179,11,181],[11,182,11,184],[11,206,11,208],[11,209,11,211],[11,212,11,214],[11,215,11,217],[11,218,11,220],[11,185,11,187],[11,188,11,190],[11,191,11,193],[11,68,11,70],[11,71,11,73],[11,74,11,76],[11,41,11,43],[11,44,11,46],[11,47,11,49],[11,50,11,52],[11,53,11,55],[11,56,11,58],[11,59,11,61],[11,62,11,64],[11,65,11,67],[11,35,11,37],[11,38,11,40],[11,8,11,10],[11,11,11,13],[11,14,11,16],[11,17,11,19],[11,20,11,22],[14,1,14,4],[3,3,3,4],[5,3,5,4],[11,23,11,25],[11,26,11,28],[11,29,11,31],[11,32,11,34],[12,8,12,10],[12,11,12,13],[12,14,12,16],[12,17,12,19],[12,20,12,22],[12,23,12,25],[12,26,12,28],[12,29,12,31],[12,32,12,34],[12,35,12,37],[18,1,18,2],[35,1,35,2],[50,1,50,2],[28,1,28,2],[29,1,29,2],[8,1,8,4],[9,1,9,4],[10,1,10,4],[11,1,11,4],[12,1,12,4],[30,3,31,3],[30,1,31,2],[30,4,31,4],[39,2,40,2],[43,1,44,2],[43,3,44,3],[43,4,44,4],[39,4,40,4],[39,3,40,3],[41,4,42,4],[39,1,42,1],[41,2,42,2],[41,3,42,3],[13,1,13,4]]}
["★基本情報入力欄　はじめに太枠内の情報を入力してください。"]
[null,"都道府県名",null,"○○県","　←　「都道府県」まで記入してください。"]
[null,"市町村名",null,"○○市","　←　「市町村」まで記入してください。"]
[null,"対象組織名",null,"○○・・・・・・活動組織"]
[null,"代表者名",null,"○○　○○"]
[null,"代表者住所",null,"○○県○○市○丁目"]
[]
["★記入の手順と注意事項（Excelで様式を作成する場合）"]
[null,"・様式1-1号シートから順番に入力してください。"]
[null,"・画面下の様式名を選択すると、入力する様式を切り替えることができます。左下の◀▶をクリックすることで、隠れている様式を表示させることができます。"]
[null,"・活動組織の方が入力するセルには、この色が塗ってあります。"]
[null,"・この色が塗ってあるセルは自動で入力されます。自動入力されたものが間違っている場合は、正しく修正してください。"]
[null,"・行を追加する際は、一番左にある行番号をクリックして行全体をコピーし、表の最下部の太線より上の位置で行番号を右クリックし「コピーしたセルの挿入」を選択してください。"]
[null,"・入力するセル以外は編集できないよう設定してあります。自動入力されたものを訂正する場合や、行の挿入等を行う場合は、「校閲」の「シート保護の解除」をクリックしてください。"]
[null,"・計算式が入っているセルは変更しないでください。自動入力や自動計算ができなくなります。"]
[]
["★提出書類と各シートの説明"]
["１．事業計画の申請時に提出するもの"]
[null,"シート名",null,"提出の必要性","書類名"]
[null,"様式１－１号",null,"必須","様式第1-1号 多面的機能発揮促進事業に関する計画の認定の申請について"]
[null,"様式１－２号",null,"必須","様式第1-2号 多面的機能発揮促進事業に関する計画"]
[null,"様式１－３号",null,"必須","様式第1-3号 農業の有する多面的機能の発揮の促進に関する活動計画書"]
[null,null,"活動計画書","必須","様式第1-3号別紙１ 多面的機能支払交付金に係る活動計画書（１号事業様式）"]
[null,null,"　加算措置","必要に応じて","　※加算措置に取り組む場合のみ提出"]
[null,null,"位置図","必須","様式第1-3号別紙１別添１　実施区域位置図"]
[null,null,"田んぼダム位置図","必要に応じて","様式第1-3号別紙１別添３　田んぼダム実施区域位置図"]
[null,null,"構成員一覧","必須（どちらかを提出）","活動組織の規約別紙（構成員一覧）"]
[null,"別ファイル",null,null,"様式第1-3号別紙１別添２　構成員一覧"]
[null,"長寿命化整備計画",null,"必要に応じて","様式第1-4号 長寿命化整備計画書"]
[null,"工事確認書",null,"必要に応じて","様式第1-5号 工事に関する確認書"]
[null,"みどりチェック",null,"必須","様式第1-11号 環境負荷低減のクロスコンプライアンス（みどりチェック）\nチェックシート（申請時の項目を記入）"]
[]
[null,"別ファイル",null,"必須","別記6-1 活動組織規約 又は別記5-2 広域協定運営委員会規則"]
[]
["２．実施状況の報告時に提出するもの"]
[null,"シート名",null,"提出の必要性","書類名"]
[null,"活動記録",null,"必須に応じて","様式第1-6号 活動記録 ※農地維持支払のみに取り組む場合、提出不要"]
[null,"金銭出納簿",null,"必須","様式第1-7号 金銭出納簿"]
[null,"報告書",null,"必須","様式第1-8号 実施状況報告書"]
[null,null,"環境負荷低減の\n取組への支援","必要に応じて","様式第1-8号別紙1,2 環境負荷低減の取組への支援"]
[]
[null,null,"持越金の使用予定表","必要に応じて","様式第1-8号別紙3 持越金の使用予定表\n※持越金の額が規定以上になる場合のみ提出"]
[]
[null,"みどりチェック",null,"必須","様式第1-11号 環境負荷低減のクロスコンプライアンス（みどりチェック）\nチェックシート（報告時の項目を記入）"]
[]
[null,"別ファイル",null,"必須に応じて","様式第1-12号 環境負荷低減の取組への支援に係る実施経過報告書"]
[null,"別ファイル",null,"必須に応じて","様式第1-12号別紙1,2（様式第1-8号別紙1,2と同様）"]
[null,"別ファイル",null,"必須に応じて","様式第1-13号 環境負荷低減の取組への支援に係る履行困難理由書"]
[]
["３．取組番号表"]
[null,"シート名",null,"提出の必要性","内容"]
[null,"取組番号早見表",null,null,"活動記録に記載する取組の番号早見表"]
[null,"取組番号表",null,null,"活動記録に記載する取組の番号表（詳細版）"]
["４．その他のシート（活動組織の方は入力不要です）"]
[null,"シート名",null,"提出の必要性","内容"]
[null,"選択肢",null,null,"選択肢のリスト　活動組織の方は、選択肢を変更しないでください。"]
[null,"市町村用",null,null,"市町村が都道府県に報告する様式"]
[null,"別記3-1(1)",null,null,"市町村の確認用様式"]
[null,"別記3-1(2)",null,null,"市町村の確認用様式"]
[null,"別記3-1(3)",null,null,"市町村の確認用様式"]
[null,"市町村コード",null,null,"集計用の市町村コード一覧表"]

{"sheet":"【参考】交付単価（PC）","index":1,"n_rows":27,"n_cols":26,"rows_kept":27,"cut":false,"hidden":false,"merged":[[12,0,12,11],[25,1,25,2],[25,3,25,4],[24,0,24,11],[13,1,13,2],[13,3,13,4],[13,5,13,6],[18,0,18,8],[19,1,19,2],[19,3,19,4],[19,5,19,6],[4,13,4,25],[6,9,7,10],[6,11,7,12],[1,0,3,12],[0,0,0,12],[4,0,4,2],[6,1,7,2],[6,3,7,4],[6,5,7,6],[5,1,5,6],[5,0,7,0],[5,7,5,12],[6,7,7,8],[5,13,7,13],[5,14,5,19],[5,20,5,25],[25,14,25,15],[25,16,25,17],[6,24,7,25],[13,14,13,15],[13,16,13,17],[19,14,19,15],[19,16,19,17],[6,14,7,15],[6,16,7,17],[6,18,7,19],[6,20,7,21],[6,22,7,23]]}
["★基本情報確認用",null,null,null,null,null,null,null,null,null,null,null,null,"条件分岐（別紙１活動計画書で選択）"]
["本様式では、多面的機能支払交付金実施要綱において国が示す交付単価が入力されています。都道府県独自の交付単価（要綱基本方針に定められている交付単価）を使用している場合、まずは下の表の値を修正してください。",null,null,null,null,null,null,null,null,null,null,null,null,"共同","加算",null,"長寿命化"]
[null,null,null,null,null,null,null,null,null,null,null,null,null,{"$f":"IF(COUNTIF('別紙1 活動計画書'!Q25:V27,\"○\")>1,\"error\",\"ok\")","v":"ok"},{"$f":"IF(COUNTIF('別紙1 活動計画書'!Q25:V27,\"○\")>1,\"error\",\"ok\")","v":"ok"}]
[null,null,null,null,null,null,null,null,null,null,null,null,null,{"$f":"IF('別紙1 活動計画書'!Q25=\"○\",1,IF('別紙1 活動計画書'!V25=\"○\",0.625,IF('別紙1 活動計画書'!Q27=\"○\",0.75,IF('別紙1 活動計画書'!V27=\"○\",5/6,IF(COUNTIF('別紙1 活動計画書'!Q25:V27,\"○\")=0,1)))))","v":1},{"$f":"IF('別紙1 活動計画書'!Q25=\"○\",1,IF('別紙1 活動計画書'!V25=\"○\",0.75,IF('別紙1 活動計画書'!Q27=\"○\",0.75,IF('別紙1 活動計画書'!V27=\"○\",1,IF(COUNTIF('別紙1 活動計画書'!Q25:V27,\"○\")=0,1)))))","v":1},null,{"$f":"IF('別紙1 活動計画書'!V39=\"○\",5/6,1)","v":1}]
["○基本単価",null,null,null,null,null,null,null,null,null,null,null,null,"○取組状況に応じた減額後（計算シート）"]
[null,"都府県",null,null,null,null,null,"北海道",null,null,null,null,null,null,"都府県",null,null,null,null,null,"北海道"]
[null,"農地維持支払",null,"資源向上支払\n（共同）",null,"資源向上支払\n（長寿命化）",null,"農地維持支払",null,"資源向上支払\n（共同）",null,"資源向上支払\n（長寿命化）",null,null,"農地維持支払",null,"資源向上支払\n（共同）",null,"資源向上支払\n（長寿命化）",null,"農地維持支払",null,"資源向上支払\n（共同）",null,"資源向上支払\n（長寿命化）"]
[]
["田",3000,"円/10a",2400,"円/10a",4400,"円/10a",2300,"円/10a",1920,"円/10a",3400,"円/10a","田",{"$f":"B9","v":3000},"円/10a",{"$f":"ROUNDDOWN(D9*$N$4,0)","v":2400},"円/10a",{"$f":"ROUNDDOWN(F9*$Q$4,0)","v":4400},"円/10a",{"$f":"H9","v":2300},"円/10a",{"$f":"ROUNDDOWN(J9*$N$4,0)","v":1920},"円/10a",{"$f":"ROUNDDOWN(L9*$Q$4,0)","v":3400},"円/10a"]
["畑",2000,"円/10a",1440,"円/10a",2000,"円/10a",1000,"円/10a",480,"円/10a",600,"円/10a","畑",{"$f":"B10","v":2000},"円/10a",{"$f":"ROUNDDOWN(D10*$N$4,0)","v":1440},"円/10a",{"$f":"ROUNDDOWN(F10*$Q$4,0)","v":2000},"円/10a",{"$f":"H10","v":1000},"円/10a",{"$f":"ROUNDDOWN(J10*$N$4,0)","v":480},"円/10a",{"$f":"ROUNDDOWN(L10*$Q$4,0)","v":600},"円/10a"]
["草地",250,"円/10a",240,"円/10a",400,"円/10a",130,"円/10a",120,"円/10a",400,"円/10a","草地",250,"円/10a",240,"円/10a",400,"円/10a",130,"円/10a",120,"円/10a",400,"円/10a"]
[]
["○加算措置（多面的機能の更なる増進に向けた活動への支援）"]
[null,"都府県",null,"北海道",null,null,null,null,null,null,null,null,null,null,"都府県",null,"北海道"]
["田",400,"円/10a",320,"円/10a",null,null,null,null,null,null,null,null,"田",{"$f":"ROUNDDOWN(B15*$O$4,0)","v":400},"円/10a",{"$f":"ROUNDDOWN(D15*$O$4,0)","v":320},"円/10a"]
["畑",240,"円/10a",80,"円/10a",null,null,null,null,null,null,null,null,"畑",{"$f":"ROUNDDOWN(B16*$O$4,0)","v":240},"円/10a",{"$f":"ROUNDDOWN(D16*$O$4,0)","v":80},"円/10a"]
["草地",40,"円/10a",20,"円/10a",null,null,null,null,null,null,null,null,"草地",40,"円/10a",20,"円/10a"]
[]
["○加算措置（農村協働力の深化に向けた活動への支援）"]
[null,"都府県",null,"北海道",null,null,null,null,null,null,null,null,null,null,"都府県",null,"北海道"]
["田",400,"円/10a",320,"円/10a",null,null,null,null,null,null,null,null,"田",{"$f":"ROUNDDOWN(B21*$O$4,0)","v":400},"円/10a",{"$f":"ROUNDDOWN(D21*$O$4,0)","v":320},"円/10a"]
["畑",240,"円/10a",80,"円/10a",null,null,null,null,null,null,null,null,"畑",{"$f":"ROUNDDOWN(B22*$O$4,0)","v":240},"円/10a",{"$f":"ROUNDDOWN(D22*$O$4,0)","v":80},"円/10a"]
["草地",40,"円/10a",20,"円/10a",null,null,null,null,null,null,null,null,"草地",40,"円/10a",20,"円/10a"]
[]
["○加算措置（水田の雨水貯留機能の強化（田んぼダム）を推進する活動への支援）"]
[null,"都府県",null,"北海道",null,null,null,null,null,null,null,null,null,null,"都府県",null,"北海道"]
["田",400,"円/10a",320,"円/10a",null,null,null,null,null,null,null,null,"田",{"$f":"ROUNDDOWN(B27*$O$4,0)","v":400},"円/10a",{"$f":"ROUNDDOWN(D27*$O$4,0)","v":320},"円/10a"]

{"sheet":"様式第1-3号","index":2,"n_rows":70,"n_cols":14,"rows_kept":70,"cut":false,"hidden":false,"merged":[[8,3,8,4],[8,5,8,11],[9,3,9,4],[11,3,11,4],[11,5,11,11],[2,12,2,13],[3,1,3,13],[5,3,5,4],[5,5,5,11],[6,3,6,4],[6,5,6,11],[9,5,9,11],[21,4,21,11],[25,2,25,13],[27,1,27,13],[29,1,29,2],[29,3,29,4],[29,5,29,6],[29,7,29,8],[29,9,29,10],[12,3,12,4],[12,5,12,11],[15,4,15,13],[18,4,18,11],[19,4,19,11],[20,4,20,11],[30,1,31,2],[30,3,30,4],[30,5,30,6],[30,7,30,8],[30,9,30,10],[31,3,31,4],[31,5,31,6],[31,7,31,8],[31,9,31,10],[32,1,33,2],[32,3,32,4],[32,5,32,6],[32,7,32,8],[32,9,32,10],[33,3,33,4],[33,5,33,6],[33,7,33,8],[33,9,33,10],[34,1,35,2],[34,3,34,4],[34,5,34,6],[34,7,34,8],[34,9,34,10],[35,3,35,4],[35,5,35,6],[35,7,35,8],[35,9,35,10],[36,1,37,2],[36,3,36,4],[36,5,36,6],[36,7,36,8],[36,9,36,10],[37,3,37,4],[37,5,37,6],[37,7,37,8],[37,9,37,10],[41,11,42,11],[41,12,42,12],[41,13,42,13],[42,3,42,4],[42,5,42,6],[42,7,42,8],[42,9,42,10],[38,1,39,2],[38,3,38,4],[38,5,38,6],[38,7,38,8],[38,9,38,10],[39,3,39,4],[39,5,39,6],[39,7,39,8],[39,9,39,10],[43,2,44,2],[43,3,43,4],[43,5,43,6],[43,7,43,8],[43,9,44,10],[44,3,44,4],[44,5,44,6],[44,7,44,8],[41,1,42,2],[46,11,48,11],[46,12,48,12],[46,13,48,13],[47,3,48,3],[47,5,48,5],[47,7,48,7],[47,9,48,9],[45,2,48,2],[45,3,45,4],[45,5,45,6],[45,7,45,8],[45,9,45,10],[46,3,46,4],[46,5,46,6],[46,7,46,8],[46,9,46,10],[49,1,50,1],[49,2,50,2],[49,3,49,12],[50,3,50,12],[51,1,51,13],[52,1,55,4],[54,5,54,6],[54,7,54,8],[54,9,54,10],[55,5,55,6],[55,7,55,8],[55,9,55,10],[53,7,53,8],[52,5,52,8],[52,9,53,10],[52,11,53,11],[56,2,57,4],[56,5,56,6],[56,7,56,8],[56,9,56,10],[57,5,57,6],[69,1,69,13],[67,1,67,13],[57,7,57,8],[57,9,57,10],[58,1,58,13],[62,1,62,13],[64,1,64,4],[66,1,66,4],[65,1,65,4]]}
["（様式第１－３号）"]
["【活動組織から市町村に提出するもの】",null,null,null,null,null,null,null,null,null,null,null,null,"農林水産省様式"]
[null,null,null,null,null,null,null,null,null,null,null,null,{"$f":"#REF!","v":{"$error":"#REF!"}}]
[null,"農業の有する多面的機能の発揮の促進に関する活動計画書\n（多面的機能支払に係る活動計画書、中山間地域等直接支払に係る集落協定、\n環境保全型農業直接支払に係る営農活動計画書）"]
[]
[null,null,null,"（ふりがな）"]
[null,null,null,"組織名",null,{"$f":"'はじめに（PC）'!D4&\"\"","v":"○○・・・・・・活動組織"}]
[]
[null,null,null,"（ふりがな）"]
[null,null,null,"代表者氏名",null,{"$f":"'はじめに（PC）'!D5&\"\"","v":"○○　○○"}]
[]
[null,null,null,"（ふりがな）"]
[null,null,null,"所在地",null,{"$f":"'はじめに（PC）'!D6&\"\"","v":"○○県○○市○丁目"}]
[]
[]
[null,null,null,"Ⅰ．　","地区の概要（共通）"]
[]
[null,null,null,"＜活動の計画＞"]
[null,null,null,"■","Ⅱ． １号事業（多面的機能支払）",null,null,null,null,null,null,null,"別紙１"]
[null,null,null,"□","Ⅲ． ２号事業（中山間地域等直接支払）",null,null,null,null,null,null,null,"別紙　"]
[null,null,null,"□","Ⅳ． ３号事業（環境保全型農業直接支払）",null,null,null,null,null,null,null,"別紙　"]
[null,null,null,"□","Ⅴ． その他多面的機能の発揮の促進に資する事業に係る計画書",null,null,null,null,null,null,null,"別紙　"]
[null,null,null,"（注）該当する活動にチェックし、取り組む活動の別紙のみ添付すること"]
[]
[null,null,"＜施行注意＞"]
[null,null,"　提出の際に（　）内は、多面的機能支払に係る活動計画書、中山間地域等直接支払に係る集落協定、環境保全型農業直接支払に係る営農活動計画書のうち該当する活動の計画書若しくは協定を記載すること。"]
["Ⅰ．地区の概要"]
[null,"※ 以下、（多面的機能支払、中山間地域等直接支払、環境保全型農業直接支払）をそれぞれ（多面支払、中山間直払、環境直払）と一部で表示"]
[null," １．活動期間"]
[null,null,null,"活動開始年度",null,"活動終了年度",null,"交付金の\n交付年数",null,"計画変更年度",null,"計画変更年度"]
[null,"農地維持支払"]
[null,null,null,"7年度",null,"12年度",null,5,null,"○年度",null,"○年度"]
[null,"資源向上支払（共同）"]
[null,null,null,"7年度",null,"12年度",null,5,null,"○年度",null,"○年度"]
[null,"資源向上支払（長寿命化）"]
[null,null,null,"7年度",null,"12年度",null,5,null,"○年度",null,"○年度"]
[null,"中山間地域等\n直接支払"]
[null,null,null,"○年度",null,"○年度",null,0,null,"○年度",null,"○年度"]
[null,"環境保全型農業直接支払"]
[null,null,null,"○年度",null,"○年度",null,0,null,"○年度",null,"○年度"]
[null," ２．実施区域内の農用地、施設"]
[null,"協定農用地面積\n又は認定農用地面積※１",null,null,null,null,null,null,null,null,null,"計","うち解消する遊休\n農地面積","年当たり\n交付金額\n上限"]
[null,null,null,"田",null,"畑",null,"草地",null,"採草放牧地"]
[null,null,"多面\n支払",null,null,null,null,null,null,null,null,{"$f":"SUM(D44,F44,H44)","v":0}]
[null,null,null,0,null,0,null,0,null,null,null,{"$f":"SUM(D45:I45)","v":0},0,{"$f":"SUM('別紙1 活動計画書'!I16,'別紙1 活動計画書'!I27,'加算措置（みどり加算以外）'!I37,'加算措置（みどり加算以外）'!I68,'加算措置（みどり加算以外）'!O101)+IF('別紙1 活動計画書'!V45=\"○\",MIN('別紙1 活動計画書'!S47,'別紙1 活動計画書'!I44),'別紙1 活動計画書'!I44)+IFERROR(VLOOKUP(\"○\",'加算措置（みどり加算以外）'!I78:P80,5,FALSE),0)+IF('加算措置（みどり加算以外）'!J74>0,400000,0)+MAX('加算措置（みどり加算）'!S41:AE41)","v":0}]
[null,null,"中山間\n直払",null,null,null,null,null,null,null,null,{"$f":"SUM(D46:K46)","v":0}]
[null,null,null,0,null,0,null,0,null,0,null,{"$f":"SUM(D47:J47)","v":0},0,0]
[null,null,null,"傾斜",null,"傾斜",null,"傾斜",null,"傾斜"]
[]
[null,"取組面積","環境\n直払※２",0]
[null,null,null,0,null,null,null,null,null,null,null,null,null,0]
[null,"※１　 多面支払の認定農用地面積は、集落が管理する農用地面積を記載する。\n※２ 　環境直払に取り組む場合は、Ⅳの４の交付金額の取組面積の合計及び年当たり交付金額上限の合計\n         を記載するものとする。"]
[null,"農業用施設\n（多面支払）",null,null,null,"水路",null,null,null,"農道",null,"ため池"]
[null,null,null,null,null,null,null,"うち、排水路"]
[]
[null,null,null,null,null,0,null,0,null,0,null,0]
[null,null,"うち、資源向上支払\n（長寿命化）の対象施設"]
[null,null,null,null,null,0,null,0,null,0,null,0]
[null,"※　延長は、小数点以下第１位まで記入する。"]
[null," ３．実施区域位置図"]
[null,"別添１「実施区域位置図」のとおり　"]
[null," ４．組織構成員一覧"]
[null,"別添２「構成員一覧」のとおり\n※　多面支払のみに取り組む場合は、活動組織規約の別紙「構成員一覧」に代えることができる。"]
[null," ５．多面的機能支払と中山間地域等直接支払との重複面積"]
[null,"重複面積\n（多面支払・中山間直払）"]
[null,{"$f":"L44+L46-D66","v":0}]
[null,0]
[null,"※　多面支払の活動計画書及び中山間直払の集落協定に位置づけられている施設等については、多面支払の\n　　活動組織により活動を実施し、また、多面支払の交付金を充てることとする。"]
[null,"＜施行注意＞"]
[null,"　計画書の変更の際には、容易に比較対照できるよう変更部分を二段書きとし、変更前を（　）書で上段に\n記載するものとする。"]

{"sheet":"別紙1 活動計画書","index":3,"n_rows":193,"n_cols":43,"rows_kept":193,"cut":false,"hidden":false,"merged":[[146,3,146,13],[147,3,147,13],[148,3,148,13],[128,1,139,1],[121,4,121,13],[122,4,122,13],[124,4,124,13],[125,4,125,13],[126,4,126,13],[123,4,123,13],[121,14,121,21],[122,14,122,21],[124,14,124,21],[125,14,125,21],[127,14,127,21],[139,4,139,13],[138,4,138,14],[143,3,143,13],[144,3,144,13],[141,3,142,13],[126,14,126,21],[123,14,123,21],[91,1,91,11],[90,3,90,11],[127,4,127,13],[130,4,130,13],[116,4,116,13],[117,4,117,13],[118,4,118,13],[119,4,119,13],[120,4,120,13],[89,3,89,11],[74,20,85,22],[136,4,136,13],[137,4,137,13],[104,16,104,21],[106,1,106,22],[107,2,107,11],[107,13,107,21],[108,2,108,11],[109,2,109,11],[109,16,109,21],[80,12,80,19],[82,2,84,2],[132,4,132,13],[133,4,133,13],[134,4,134,13],[135,4,135,13],[95,13,95,22],[96,16,96,21],[99,16,99,21],[110,2,110,11],[129,4,129,13],[114,1,115,3],[128,4,128,13],[43,8,43,11],[88,3,88,11],[85,3,85,11],[84,3,84,11],[83,3,83,11],[82,3,82,11],[80,3,80,11],[79,3,79,11],[78,3,78,11],[77,3,77,11],[75,3,75,11],[49,4,49,8],[49,9,49,13],[50,1,50,3],[53,4,53,6],[64,1,64,3],[64,4,64,6],[64,7,64,9],[64,10,64,12],[69,3,70,11],[19,1,20,1],[19,8,19,11],[20,2,20,4],[20,5,20,6],[20,8,20,11],[14,5,15,7],[14,8,14,11],[21,1,22,1],[18,2,18,4],[18,5,18,7],[19,2,19,4],[19,5,19,6],[23,2,23,4],[31,13,31,21],[13,14,13,19],[30,14,30,19],[26,13,26,15],[26,18,26,20],[28,13,28,19],[24,13,24,15],[24,18,24,20],[25,13,25,15],[18,13,20,22],[21,14,22,22],[29,13,29,22],[15,2,15,4],[15,8,15,11],[13,1,13,11],[22,5,22,6],[22,8,22,11],[9,1,10,1],[9,2,9,4],[9,5,9,6],[9,8,9,11],[10,2,10,4],[10,5,10,6],[10,8,10,11],[11,1,12,1],[11,2,11,4],[11,5,11,6],[11,8,11,11],[12,2,12,4],[12,5,12,6],[12,8,12,11],[18,8,18,11],[14,1,15,1],[14,2,14,4],[21,2,21,4],[21,5,21,6],[21,8,21,11],[22,2,22,4],[1,1,1,21],[3,1,3,7],[6,2,6,4],[6,5,6,7],[6,8,6,11],[7,1,8,1],[7,2,7,4],[7,5,7,6],[7,8,7,11],[8,2,8,4],[8,5,8,6],[8,8,8,11],[4,5,4,22],[6,13,8,22],[23,8,23,11],[24,2,24,4],[24,5,24,6],[24,8,24,11],[36,8,36,11],[37,1,38,1],[35,1,36,1],[35,2,35,4],[35,5,35,6],[35,8,35,11],[36,2,36,4],[36,5,36,6],[25,1,25,11],[26,1,27,1],[26,5,27,7],[37,2,37,4],[37,5,37,6],[38,2,38,4],[38,5,38,6],[34,2,34,4],[34,5,34,7],[34,8,34,11],[37,8,37,11],[23,1,24,1],[39,1,40,1],[69,12,70,12],[69,1,70,2],[71,1,72,2],[73,1,73,2],[74,3,74,11],[73,3,73,11],[72,3,72,11],[71,3,71,11],[73,12,73,19],[74,1,90,1],[74,2,77,2],[85,2,89,2],[83,12,83,19],[84,12,84,19],[41,1,41,11],[42,1,43,1],[42,2,42,4],[42,5,43,7],[42,8,42,11],[43,2,43,4],[41,13,43,22],[46,13,46,17],[39,2,39,4],[186,1,186,2],[186,3,186,6],[186,7,186,12],[186,13,186,14],[141,26,142,26],[141,14,142,14],[128,2,132,3],[139,2,139,3],[141,1,142,2],[133,2,138,3],[179,7,179,12],[179,13,179,14],[157,16,157,21],[175,1,175,20],[176,1,176,12],[176,13,176,15],[177,1,177,2],[177,3,177,6],[177,7,177,12],[159,2,159,9],[171,1,171,21],[170,1,170,21],[161,1,161,21],[176,16,176,18],[192,1,192,21],[188,1,188,2],[188,3,188,6],[188,7,188,12],[188,13,188,14],[191,9,191,12],[191,1,191,6],[191,18,191,22],[187,1,187,2],[187,3,187,6],[187,7,187,12],[187,13,187,14],[189,1,189,18],[188,16,188,17],[184,1,184,2],[184,3,184,6],[184,7,184,12],[184,13,184,14],[116,1,127,1],[116,2,120,3],[121,2,121,3],[122,2,127,3],[114,14,115,14],[181,7,181,12],[181,13,181,14],[178,1,178,2],[178,3,178,6],[178,7,178,12],[178,13,178,14],[179,1,179,2],[180,3,180,6],[158,8,158,15],[180,1,180,2],[180,7,180,12],[180,13,180,14],[181,1,181,2],[181,3,181,6],[158,1,158,6],[182,1,182,2],[182,3,182,6],[182,7,182,12],[182,13,182,14],[183,1,183,2],[183,3,183,6],[183,7,183,12],[183,13,183,14],[131,4,131,13],[149,3,149,13],[150,3,150,13],[151,3,151,13],[152,3,152,13],[153,3,153,14],[154,3,154,13],[179,3,179,6],[162,7,162,8],[163,7,163,8],[164,7,164,8],[165,7,165,8],[166,7,166,8],[167,7,167,8],[143,1,154,2],[145,3,145,13],[11,27,12,27],[64,18,64,20],[64,15,64,17],[11,24,12,24],[7,25,8,25],[7,26,8,26],[49,14,49,18],[49,19,50,21],[24,26,24,27],[38,26,38,28],[39,26,39,27],[34,26,36,29],[11,28,12,28],[11,29,12,29],[9,13,12,22],[13,20,13,21],[40,26,40,27],[41,26,41,27],[42,26,42,27],[43,26,43,27],[18,26,18,28],[19,26,19,27],[20,26,20,27],[21,26,21,27],[5,24,6,24],[7,24,8,24],[9,24,10,24],[11,30,12,30],[4,25,4,27],[4,28,4,30],[5,28,6,28],[5,29,6,29],[5,30,6,30],[7,28,8,28],[7,29,8,29],[7,30,8,30],[9,28,10,28],[9,29,10,29],[9,30,10,30],[5,26,6,26],[5,27,6,27],[5,25,6,25],[7,27,8,27],[9,25,10,25],[9,26,10,26],[9,27,10,27],[11,25,12,25],[11,26,12,26],[182,16,182,17],[183,16,183,17],[184,16,184,17],[185,16,185,17],[186,16,186,17],[187,16,187,17],[44,26,44,27],[178,16,178,17],[179,16,179,17],[158,16,158,21],[46,18,46,21],[155,1,155,22],[156,1,156,21],[157,1,157,6],[157,8,157,15],[90,12,90,19],[133,15,137,22],[128,15,132,22],[116,15,119,22],[114,4,115,13],[185,1,185,2],[185,3,185,6],[185,7,185,12],[185,13,185,14],[22,26,22,27],[23,26,23,27],[44,14,44,19],[180,16,180,17],[181,16,181,17],[76,3,76,11],[76,12,76,19],[81,3,81,11],[78,2,81,2],[86,3,86,11],[86,12,86,19],[87,3,87,11],[87,12,87,19],[34,13,36,21],[38,14,38,19],[26,2,27,4],[39,5,39,6],[39,8,39,11],[40,2,40,4],[40,5,40,6],[40,8,40,11],[38,8,38,11],[26,8,27,11],[23,5,23,6]]}
[null,null,null,null,null,null,null,null,null,null,null,null,null,null,null,null,null,null,null,null,null,"（別紙1）"]
[null,"多面的機能支払に係る活動計画書（1号事業様式）"]
["Ⅱ． １号事業（多面的機能支払）"]
[null,"対象組織が広域活動組織の場合は○",null,null,null,null,null,null,null,"⇒"]
["１．交付金額 　 ",null,null,null,null,"※複数の交付単価がある場合には、行を追加してください。\n※加算措置は除きます。"]
["（１）農地維持支払"]
[null,"地目","対象農用地面積",null,null,"交付単価",null,null,"年当たり交付金額",null,null,null,null,"※対象農用地面積とは、交付金の算定の対象となる農用地の面積のことです。小数点以下を切り捨て、整数で記入してください。"]
[null,"田",null,null,null,null,null,null,{"$f":"ROUNDDOWN((INT(C8)*F8/10),0)","v":0}]
[null,null,0,null,null,{"$f":"IF('はじめに（PC）'!$D$2=\"北海道\",'【参考】交付単価（PC）'!U9,'【参考】交付単価（PC）'!O9)","v":3000},null,"円/10a",{"$f":"ROUNDDOWN((INT(C9)*F9/10),0)","v":0}]
[null,"畑",null,null,null,null,null,null,0,null,null,null,null,"★活動期間中に、田から畑への地目の変更が生じた場合は下記に記入し、市町村に提出してください。農地維持支払の単価が活動終了年度まで田の単価となります。"]
[null,null,0,null,null,{"$f":"IF('はじめに（PC）'!$D$2=\"北海道\",'【参考】交付単価（PC）'!U10,'【参考】交付単価（PC）'!O10)","v":2000},null,"円/10a",0]
[null,"草地",null,null,null,null,null,null,0]
[null,null,0,null,null,{"$f":"IF('はじめに（PC）'!$D$2=\"北海道\",'【参考】交付単価（PC）'!U11,'【参考】交付単価（PC）'!O11)","v":250},null,"円/10a",0]
[null,"この線より上に行を挿入してください。",null,null,null,null,null,null,null,null,null,null,null,null,"地目を田から畑に変更する面積",null,null,null,null,null,0]
[null,"合計",{"$f":"INT(SUM(C8,C10,C12))","v":0},null,null,null,null,null,{"$f":"SUM(I8,I10,I12)","v":0}]
[null,null,{"$f":"INT(SUM(C9,C11,C13))","v":0},null,null,null,null,null,{"$f":"SUM(I9,I11,I13)","v":0}]
[]
["（２）資源向上支払（共同）  "]
[null,"地目","対象農用地面積",null,null,"交付単価",null,null,"年当たり交付金額",null,null,null,null,"※交付単価は、以下①、②への取組状況によって異なります。左の表には減額する前の単価が入力されており、以下の該当するパターンに〇を付けると自動で減額されます。"]
[null,"田",null,null,null,null,null,null,{"$f":"ROUNDDOWN((INT(C20)*F20/10),0)","v":0}]
[null,null,0,null,null,{"$f":"IF('はじめに（PC）'!$D$2=\"北海道\",'【参考】交付単価（PC）'!W9,'【参考】交付単価（PC）'!Q9)","v":2400},null,"円/10a",0]
[null,"畑",null,null,null,null,null,null,0,null,null,null,null,null,"①多面的機能の増進活動に取り組む\n②資源向上支払（共同）を５年以上実施、又は資源向上支払（長寿命化）に取り組む"]
[null,null,0,null,null,{"$f":"IF('はじめに（PC）'!$D$2=\"北海道\",'【参考】交付単価（PC）'!W10,'【参考】交付単価（PC）'!Q10)","v":1440},null,"円/10a",0]
[null,"草地",null,null,null,null,null,null,0]
[null,null,0,null,null,{"$f":"IF('はじめに（PC）'!$D$2=\"北海道\",'【参考】交付単価（PC）'!W11,'【参考】交付単価（PC）'!Q11)","v":240},null,"円/10a",0,null,null,null,null,"①のみ該当\n（修正なし）",null,null,null,null,"②のみ該当\n(単価×0.625)"]
[null,"この線より上に行を挿入してください。"]
[null,"合計",{"$f":"INT(SUM(C21,C23,C25))","v":0},null,null,null,null,null,{"$f":"SUM(I21,I23,I25)","v":0},null,null,null,null,"①②に該当\n(単価×0.75)",null,null,null,null,"該当なし\n（単価×5/6）"]
[]
[]
[null,null,null,null,null,null,null,null,null,null,null,null,null,"※「特定事業実施者」（令和６年度に環境保全型農業直接支払交付金を受けていた農業者団体等）が加算措置「環境負荷低減の取組に係る支援」のみを実施する場合は、○を付けてください。"]
[null,null,null,null,null,null,null,null,null,null,null,null,null,null,"加算措置「環境負荷低減の取組に係る支援」のみ実施する場合は〇　",null,null,null,null,null,"⇒"]
[]
[]
["（３）資源向上支払（長寿命化）"]
[null,"地目","対象農用地面積",null,null,"交付単価",null,null,"年当たり交付上限額",null,null,null,null,"※交付単価は、直営施工の取組状況によって異なります。左の表には、減額する前の単価が入力されており、直営施工を実施しない場合は、以下に〇を付けると自動で減額されます。"]
[null,"田",null,null,null,null,null,null,{"$f":"ROUNDDOWN((INT(C36)*F36/10),0)","v":0}]
[null,null,0,null,null,{"$f":"IF('はじめに（PC）'!$D$2=\"北海道\",'【参考】交付単価（PC）'!Y9,'【参考】交付単価（PC）'!S9)","v":4400},null,"円/10a",0]
[null,"畑",null,null,null,null,null,null,0]
[null,null,0,null,null,{"$f":"IF('はじめに（PC）'!$D$2=\"北海道\",'【参考】交付単価（PC）'!Y10,'【参考】交付単価（PC）'!S10)","v":2000},null,"円/10a",0,null,null,null,null,null,"直営施工を実施しない場合は○\n（単価×5/6）",null,null,null,null,null,"⇒"]
[null,"草地",null,null,null,null,null,null,0]
[null,null,0,null,null,{"$f":"IF('はじめに（PC）'!$D$2=\"北海道\",'【参考】交付単価（PC）'!Y11,'【参考】交付単価（PC）'!S11)","v":400},null,"円/10a",0]
[null,"この線より上に行を挿入してください。",null,null,null,null,null,null,null,null,null,null,null,"※広域活動組織となるための規模要件を満たさない場合は、左記合計と集落数×200万円のいずれか小さい方が上限となります。"]
[null,"合計",{"$f":"INT(SUM(C36,C38,C40))","v":0},null,null,null,null,null,{"$f":"SUM(I36,I38,I40)","v":0}]
[null,null,{"$f":"INT(SUM(C37,C39,C41))","v":0},null,null,null,null,null,{"$f":"SUM(I37,I39,I41)","v":0}]
[null,null,null,null,null,null,null,null,null,null,null,null,null,null,"広域活動組織となるための規模要件を満たさない場合は○",null,null,null,null,null,"⇒"]
[]
[null,null,null,null,null,null,null,null,null,null,null,null,null,"集落数×200万円"]
[]
["２．組織の広域化・体制強化の計画　（計画がない場合、この項目への記入は不要です）"]
[null,null,null,null,"広域活動組織の設立",null,null,null,null,"特定非営利活動法人化",null,null,null,null,"活動支援班の設立",null,null,null,null,"※「特定非営利活動法人」とは、営農法人とは別に多面的活動に関与する法人のことです。"]
[null,"実施予定年度",null,null,null,"令和",null,"年度",null,null,"令和",null,"年度",null,null,"令和",null,"年度"]
[]
[null,"以下は市町村担当者と相談の上、記入してください。"]
[null,"集落数",null,null,0]
[]
[null,"農業地域類型",null,null,null,"都市的地域",null,null,null,"平地農業地域",null,null,null,"中間農業地域",null,null,null,"山間農業地域"]
[]
[null,"地域振興立法の適用",null,null,null,null,null,"特定農山村",null,null,"振興山村",null,null,"過疎",null,null,"半島"]
[]
[null,null,null,null,null,null,null,"離島",null,null,"沖縄",null,null,"奄美群島",null,null,"小笠原諸島"]
[]
[null,"指定棚田地域の該当状況"]
[]
[null,"交付金算定の対象としている農振農用地区域外の対象農用地面積"]
[null,"農地維持支払",null,null,0,null,null,"資源向上支払\n（共同）",null,null,0,null,null,null,null,"資源向上支払\n（長寿命化）",null,null,0]
[]
[]
["３．活動の計画"]
["（１）農地維持支払",null,null,null,null,null,null,null,null,null,"※毎年度実施するものに○を記入してください。"]
[null,"活動区分",null,"活動項目",null,null,null,null,null,null,null,null,"計画"]
[]
[null,"点検・\n計画策定",null,"１　点検",null,null,null,null,null,null,null,null,null,{"$f":"IF(M72=\"○\",\"\",\"※必ず選択してください。\")","v":"※必ず選択してください。"}]
[null,null,null,"２　年度活動計画の策定",null,null,null,null,null,null,null,null,null,{"$f":"IF(M73=\"○\",\"\",\"※必ず選択してください。\")","v":"※必ず選択してください。"}]
[null,"研修",null,"３　事務・組織運営等に関する研修、\n　　機械の安全使用に関する研修",null,null,null,null,null,null,null,null,"５年間に各１回以上実施"]
[null,"実践活動","農用地","４　遊休農地発生防止のための保全管理",null,null,null,null,null,null,null,null,null,null,null,null,null,null,null,null,{"$f":"IF(COUNTIF(M75:T86,\"○\")=0,\"※4～13のうち該当する活動項目を全て選択してください。\",\"\")","v":"※4～13のうち該当する活動項目を全て選択してください。"}]
[null,null,null,"５　畦畔・法面・防風林の草刈り"]
[null,null,null,"６　鳥獣害防護柵等の保守管理",null,null,null,null,null,null,null,null,"点検結果に応じて実施"]
[null,null,null,"100 農用地進入路の適正管理"]
[null,null,"水路","７　水路の草刈り"]
[null,null,null,"８　水路の泥上げ"]
[null,null,null,"９　水路附帯施設の保守管理",null,null,null,null,null,null,null,null,"点検結果に応じて実施"]
[null,null,null,"101 配水操作"]
[null,null,"農道","10　農道の草刈り"]
[null,null,null,"11　農道側溝の泥上げ ",null,null,null,null,null,null,null,null,"点検結果に応じて実施"]
[null,null,null,"12　路面の維持",null,null,null,null,null,null,null,null,"点検結果に応じて実施"]
[null,null,"ため池","13　ため池の草刈り"]
[null,null,null,"14　ため池の泥上げ",null,null,null,null,null,null,null,null,"点検結果に応じて実施"]
[null,null,null,"15　ため池附帯施設の保守管理",null,null,null,null,null,null,null,null,"点検結果に応じて実施"]
[null,null,null,"102 配水操作"]
[null,null,null,"103 鳥獣害防護柵の適正管理"]
[null,null,"共通","16　異常気象時の対応",null,null,null,null,null,null,null,null,"洪水、台風、地震等の発生後に実施"]
[null,"地域資源の適切な保全管理のための推進活動",null,null,null,null,null,null,null,null,null,null,null,{"$f":"IF(M92=\"○\",\"\",\"※必ず選択してください。\")","v":"※必ず選択してください。"}]
[null,"地域資源の適切な保全管理のための推進活動について、１）～４）を記入してください。"]
[null,"１）保全管理の目標を①～⑥から選んでください。（複数選択可）"]
[null,null,"①中心経営体との役割分担による保全管理",null,null,null,null,null,null,null,null,null,null,"④集落間連携や広域的活動による保全管理"]
[null,null,"②集落営農組織を基礎とした地域ぐるみの保全管理",null,null,null,null,null,null,null,null,null,null,"⑤多様な地域資源管理の担い手による保全管理"]
[null,null,"③地域外の経営体との協力・役割分担による保全管理",null,null,null,null,null,null,null,null,null,null,"⑥その他"]
[null,"２）今後、地域で取り組んでいくべき保全管理の内容を①～⑤から1項目以上選んでください。"]
[null,null,"①農地の利用集積に伴う管理作業",null,null,null,null,null,null,null,null,null,null,"④共同利用施設の保全管理"]
[null,null,"②高齢農家の農用地に係る管理作業",null,null,null,null,null,null,null,null,null,null,"⑤その他"]
[null,null,"③不在村地主等の遊休農地に係る管理作業",null,null,null,null,null,null,null,null,null,null,null,""]
[null,"３）２）で選んだ内容に取り組むため、今後進めていく活動の方向性を①～⑦から1項目以上選んでください。"]
[null,null,"①担い手の人材・機材の有効活用、連携強化",null,null,null,null,null,null,null,null,null,null,"⑤不在村地主との連絡・調整体制の構築"]
[null,null,"②入り作等の近隣の担い手との協力",null,null,null,null,null,null,null,null,null,null,"⑥集落間の連携や広域的な活動"]
[null,null,"③地域住民、土地持ち非農家等を含めた体制づくり",null,null,null,null,null,null,null,null,null,null,"⑦その他"]
[null,null,"④新たな保全管理の担い手の確保",null,null,null,null,null,null,null,null,null,null,""]
[null,"４） ２）で選んだ内容に取り組むため、毎年実践する活動を17～23から1項目以上選んでください。"]
[null,null,"17．入り作農家や土地持ち非農家を含む\n　 　農業者の検討会の開催",null,null,null,null,null,null,null,null,null,null,"21．地域住民等に対する意向調査、地\n       域住民等との集落内調査"]
[null,null,"18．農業者に対する意向調査、農業者による現地調査",null,null,null,null,null,null,null,null,null,null,"22．有識者等による研修会、検討会の開催"]
[null,null,"19．不在村地主との連絡体制の整備、調整等",null,null,null,null,null,null,null,null,null,null,"23．その他"]
[null,null,"20．集落外の住民・組織や地域住民との意見交\n       換・ワークショップ・交流会の開催",null,null,null,null,null,null,null,null,null,null,""]
[]
["（２）資源向上支払（共同）"]
["　１）施設の軽微な補修、農村環境保全活動",null,null,null,null,null,null,null,null,null,"※毎年度実施するものに○を記入してください。"]
[null,"活動区分",null,null,"活動項目",null,null,null,null,null,null,null,null,null,"計画"]
[]
[null,"施設の軽微な補修","機能診断・\n計画策定",null,"24　農用地の機能診断",null,null,null,null,null,null,null,null,null,null,{"$f":"IF(COUNTIF(O117:O120,\"○\")=0,\"※24～27のうち該当する活動項目を全て選択してください。\",\"\")","v":"※24～27のうち該当する活動項目を全て選択してください。"}]
[null,null,null,null,"25　水路の機能診断"]
[null,null,null,null,"26　農道の機能診断"]
[null,null,null,null,"27　ため池の機能診断"]
[null,null,null,null,"28　年度活動計画の策定",null,null,null,null,null,null,null,null,null,null,{"$f":"IF(O121=\"○\",\"\",\"※必ず選択してください。\")","v":"※必ず選択してください。"}]
[null,null,"研修",null,"29　機能診断・補修技術等に関する研修",null,null,null,null,null,null,null,null,null,"５年間に１回以上実施"]
[null,null,"実践活動",null,"30　農用地の軽微な補修等",null,null,null,null,null,null,null,null,null,"機能診断結果に応じて実施"]
[null,null,null,null,"104 農用地進入路の補修",null,null,null,null,null,null,null,null,null,"機能診断結果に応じて実施"]
[null,null,null,null,"31　水路の軽微な補修等",null,null,null,null,null,null,null,null,null,"機能診断結果に応じて実施"]
[null,null,null,null,"32　農道の軽微な補修等",null,null,null,null,null,null,null,null,null,"機能診断結果に応じて実施"]
[null,null,null,null,"33　ため池の軽微な補修等",null,null,null,null,null,null,null,null,null,"機能診断結果に応じて実施"]
[null,null,null,null,"105 鳥獣害防護柵の補修・設置",null,null,null,null,null,null,null,null,null,"機能診断結果に応じて実施"]
[null,"農村環境保全活動","計画策定",null,"34　生物多様性保全計画の策定",null,null,null,null,null,null,null,null,null,null,{"$f":"IF(COUNTIF(O129:O133,\"○\")=0,\"※34～38のいずれかを選択してください。\",\"\")","v":"※34～38のいずれかを選択してください。"}]
[null,null,null,null,"35　水質保全計画、農地保全計画の策定"]
[null,null,null,null,"36　景観形成計画、生活環境保全計画の策定"]
[null,null,null,null,"37　水田貯留機能増進計画、地下水かん養活動計画の策定"]
[null,null,null,null,"38　資源循環計画の策定"]
[null,null,"実践活動",null,null,null,null,null,null,null,null,null,null,null,null,{"$f":"IF(COUNTIF(O134:O138,\"○\")=0,\"※実施する活動をプルダウンリストから選択し、○をしてください。\",\"\")","v":"※実施する活動をプルダウンリストから選択し、○をしてください。"}]
[]
[]
[]
[]
[null,null,null,null,"この線より上に行を挿入してください。"]
[null,null,"啓発・普及",null,"51　啓発・普及活動",null,null,null,null,null,null,null,null,null,null,{"$f":"IF(O140=\"○\",\"\",\"※必ず選択してください。\")","v":"※必ず選択してください。"}]
["　２）多面的機能の増進を図る活動（任意）",null,null,null,null,null,null,null,null,"※毎年度実施するものに○を記入してください。"]
[null,"活動区分",null,"活動項目",null,null,null,null,null,null,null,null,null,null,"計画"]
[]
[null,"多面的機能の増進を\n図る活動",null,"52　遊休農地の有効活用"]
[null,null,null,"53　鳥獣被害防止対策及び環境改善活動の強化"]
[null,null,null,"54　地域住民による直営施工"]
[null,null,null,"55　防災・減災力の強化"]
[null,null,null,"56　農村環境保全活動の幅広い展開",null,null,null,null,null,null,null,null,null,null,null,{"$f":"IF(O148=\"○\",\"下の太枠内も記入してください。\",\"\")","v":""}]
[null,null,null,"57　やすらぎ・福祉及び教育機能の活用"]
[null,null,null,"58　農村文化の伝承を通じた農村コミュニティの強化"]
[null,null,null,"58-2　広域活動組織における活動支援班による活動の実施"]
[null,null,null,"58-3　水管理を通じた環境負荷低減活動の強化",null,null,null,null,null,null,null,null,null,null,null,{"$f":"IF(O152=\"○\",\"下の太枠内も記入してください。\",\"\")","v":""}]
[null,null,null,"59　都道府県、市町村が特に認める活動",null,null,null,null,null,null,null,null,null,null,null,{"$f":"IF(O153=\"○\",\"下の太枠内も記入してください。\",\"\")","v":""}]
[null,null,null,"この線より上に行を挿入してください。"]
[null,null,null,"60　広報活動・農村関係人口の拡大",null,null,null,null,null,null,null,null,null,null,null,{"$f":"IF(AND(O155=\"\",COUNTIF(O144:O153,\"○\")),\"※必ず選択してください。\",\"\")","v":""}]
[null,"※増進を図る活動を実施する場合は、活動項目を選択した上で、毎年度実施するとともに、「60 広報活動・農村関係人口の拡大」を毎年度実施してください。\n　ただし、農業地域類型区分の「中間農業地域」または「山間農業地域」、地域振興立法８法地域においては「60 広報活動・農村関係人口の拡大」は必須ではありません。"]
[null,"「56 農村環境保全活動の幅広い展開」を選択した場合\n\n「①農村環境保全活動を１テーマ追加」又は「②高度な保全活動の実施」のいずれかを選択し、実施する活動を選択してください。"]
[null,"①農村環境保全活動を１テーマ追加",null,null,null,null,null,null,"・・・追加する農村環境保全活動"]
[null,"②「高度な保全活動の実施」",null,null,null,null,null,null,"・・・高度な保全活動の活動項目"]
[]
[]
[null,"「58-3 水管理を通じた環境負荷低減活動の強化」を選択した場合\n\n実施する取組の実施予定面積を記入してください。"]
[null,null,"長期中干し",null,null,null,null,0]
[null,null,"冬期湛水",null,null,null,null,0]
[null,null,"夏期湛水",null,null,null,null,0]
[null,null,"中干し延期",null,null,null,null,0]
[null,null,"江の設置（作溝実施）",null,null,null,null,0]
[null,null,"江の設置（作溝未実施）",null,null,null,null,0]
[]
[]
[null,"「59 都道府県、市町村が特に認める活動」を選択した場合\n\n具体的な活動内容を記載してください。"]
[]
[]
[]
["（３）資源向上支払（長寿命化）"]
[null,"工事１件当たり200万円以上となることが明らかな場合は、様式第１－４号「長寿命化整備計画書」を作成し、添付してください。なお、１つの活動項目を分けて実施する場合は、それぞれを１件として考えます。\n※延べ数量の延長は小数点以下第２位まで記入してください。\n※施設単位について、「ため池」は「箇所」、「水路」及び「農道」は「km」とします。\n　「水路」「農道」でゲート等を施工するなど「箇所」単位とすることが一般的なものであっても、\n　「１箇所＝0.01km」として扱い、「km」単位で記入してください。"]
[null,"活動内容",null,null,null,null,null,null,null,null,null,null,null,"延べ数量",null,null,"左記が水路の場合、うち排水路延長",null,null,null,null,null,null,null,null,null,null,null,null,null,null,null,null,null,null,null,null,null,null,null,null,null,{"$f":"_xlfn.IFS(OR(B179=\"水路\",B179=\"農道\"),\"km\",B179=\"ため池\",\"箇所\",B179=\"\",\"\")","v":{"$error":"#NAME?"}}]
[null,"施設区分",null,"活動項目",null,null,null,"内容",null,null,null,null,null,null,null,"（各単位）",null,null,"（各単位）"]
[null,"水路",null,"107 水路法面の補修",null,null,null,null,null,null,null,null,null,null,null,{"$f":"IF(OR(B179=\"農道\", B179=\"水路\"), \"km\", IF(OR(B179=\"ため池\",B179=\"農地に係る施設\"), \"箇所\",\"\"))","v":"km"},null,null,{"$f":"IF(B179=\"水路\",\"km\",\"\")","v":"km"}]
[null,"農道",null,"64　農道の更新等",null,null,null,null,null,null,null,null,null,null,null,{"$f":"IF(OR(B180=\"農道\", B180=\"水路\"), \"km\", IF(OR(B180=\"ため池\",B180=\"農地に係る施設\"), \"箇所\",\"\"))","v":"km"},null,null,{"$f":"IF(B180=\"水路\",\"km\",\"\")","v":""}]
[null,"ため池",null,"65　ため池の補修",null,null,null,null,null,null,null,null,null,null,null,"箇所",null,null,""]
[null,"農地に係る施設",null,"109 農地に係る施設の補修",null,null,null,null,null,null,null,null,null,null,null,"箇所",null,null,""]
[null,null,null,null,null,null,null,null,null,null,null,null,null,null,null,"",null,null,""]
[null,null,null,null,null,null,null,null,null,null,null,null,null,null,null,"",null,null,""]
[null,null,null,null,null,null,null,null,null,null,null,null,null,null,null,"",null,null,""]
[null,null,null,null,null,null,null,null,null,null,null,null,null,null,null,"",null,null,""]
[null,null,null,null,null,null,null,null,null,null,null,null,null,null,null,"",null,null,""]
[null,null,null,null,null,null,null,null,null,null,null,null,null,null,null,"",null,null,""]
[null,null,null,null,null,null,null,null,null,null,null,null,null,null,null,"",null,null,""]
[null,"この線より上に行を挿入してください。"]
[]
[null,"☆直営施工の実施方針について",null,null,null,null,null,null,null,"全部直営施工又は\n一部直営施工を実施する",null,null,null,null,null,null,null,null,"直営施工は実施しない"]
[null,"☆上記以外に農業の多面的機能の維持・発揮に必要な共同活動を実施する場合は、その活動内容を、この活動計画書に記載してください。（別紙でも可。）（実施要領第１の２の（４）又は第２の２の（４）に基づく活動）"]

{"sheet":"加算措置（みどり加算以外）","index":4,"n_rows":119,"n_cols":24,"rows_kept":119,"cut":false,"hidden":false,"merged":[[102,1,102,21],[90,1,90,4],[86,1,86,4],[86,5,86,7],[87,2,87,3],[91,2,91,3],[92,2,92,3],[30,25,30,26],[31,25,31,26],[32,25,32,26],[33,25,33,26],[34,25,34,26],[35,25,35,26],[33,13,34,21],[66,1,67,1],[66,2,66,4],[66,5,67,7],[82,0,82,16],[90,5,90,20],[77,8,77,11],[77,12,77,15],[59,13,68,21],[59,2,59,4],[59,5,59,7],[61,29,61,30],[99,27,100,31],[101,27,102,29],[101,30,102,31],[59,26,59,28],[60,26,60,27],[61,26,61,27],[62,26,62,27],[63,26,63,27],[64,26,64,27],[65,26,65,27],[62,29,62,30],[63,29,63,30],[64,29,64,30],[65,29,65,30],[59,29,59,31],[60,29,60,30],[107,10,108,12],[107,13,108,13],[109,6,110,8],[109,9,110,9],[109,10,110,12],[109,13,110,13],[111,6,112,8],[111,9,112,9],[111,10,112,12],[111,13,112,13],[113,18,114,21],[113,14,114,17],[105,1,106,5],[107,1,108,5],[109,1,110,5],[111,1,112,5],[113,1,114,5],[105,6,106,9],[105,10,105,13],[106,10,106,13],[105,18,106,21],[107,18,108,21],[109,18,110,21],[109,14,110,17],[111,14,112,17],[111,18,112,21],[105,14,106,17],[107,14,108,17],[113,6,114,8],[113,9,114,9],[113,10,114,12],[113,13,114,13],[107,6,108,8],[107,9,108,9],[100,9,101,11],[98,2,99,5],[98,1,99,1],[98,14,99,17],[98,9,99,13],[100,12,101,13],[100,1,101,1],[100,2,101,5],[100,6,101,8],[99,6,99,8],[98,6,98,8],[23,1,23,10],[24,1,24,10],[28,13,29,21],[31,13,32,21],[29,1,30,1],[29,2,29,4],[29,5,29,6],[29,8,29,11],[30,5,30,6],[28,2,28,4],[28,5,28,7],[30,2,30,4],[25,1,25,10],[100,18,101,21],[92,5,92,20],[93,5,93,20],[94,5,94,20],[95,5,95,20],[91,5,91,20],[58,1,58,21],[63,5,63,6],[63,8,63,11],[81,1,81,21],[78,1,78,7],[78,8,78,11],[78,12,78,15],[79,1,79,7],[79,8,79,11],[79,12,79,15],[68,1,68,11],[76,1,76,7],[76,8,76,11],[76,12,76,15],[77,1,77,7],[100,14,101,17],[80,1,80,21],[93,2,93,3],[98,18,99,21],[30,8,30,11],[31,1,32,1],[31,2,31,4],[31,5,31,6],[31,8,31,11],[32,2,32,4],[32,5,32,6],[32,8,32,11],[35,1,36,1],[35,2,35,4],[35,5,36,7],[35,8,35,11],[38,0,38,21],[94,2,94,3],[95,2,95,3],[44,12,44,13],[44,15,44,18],[46,8,46,9],[46,10,46,11],[46,12,46,13],[56,17,56,18],[53,8,53,21],[46,15,46,18],[55,6,55,15],[48,6,48,7],[50,2,50,3],[50,4,50,5],[50,6,50,15],[51,3,51,9],[44,8,44,9],[44,10,44,11],[36,2,36,4],[36,8,36,11],[51,12,51,16],[34,5,34,6],[34,8,34,11],[40,12,40,13],[43,8,43,9],[43,10,43,11],[43,12,43,13],[43,15,43,18],[33,1,34,1],[33,2,33,4],[33,5,33,6],[33,8,33,11],[34,2,34,4],[60,5,60,6],[63,2,63,4],[59,8,59,11],[64,1,65,1],[64,2,64,4],[64,5,64,6],[61,2,61,4],[61,5,61,6],[61,8,61,11],[62,1,63,1],[62,2,62,4],[62,5,62,6],[3,1,3,11],[15,11,15,13],[15,14,15,17],[16,11,16,13],[17,11,17,13],[18,11,18,13],[19,11,19,13],[12,1,12,21],[11,0,11,21],[16,1,16,10],[17,1,17,10],[15,1,15,10],[16,14,16,17],[17,14,17,17],[18,14,18,17],[19,14,19,17],[4,1,4,11],[5,1,5,11],[6,1,6,11],[7,1,7,11],[8,1,8,11],[9,1,9,11],[20,14,20,17],[21,14,21,17],[20,1,20,10],[21,1,21,10],[18,1,18,10],[19,1,19,10],[22,1,22,10],[69,1,69,11],[75,0,75,21],[20,11,20,13],[21,11,21,13],[22,11,22,13],[23,11,23,13],[25,11,25,13],[24,11,24,13],[25,14,25,17],[22,14,22,17],[23,14,23,17],[24,14,24,17],[28,8,28,11],[64,8,64,11],[65,2,65,4],[65,5,65,6],[65,8,65,11],[83,1,83,21],[86,9,86,21],[55,16,55,17],[50,16,50,17],[51,10,51,11],[62,8,62,11],[71,0,71,21],[51,17,51,18],[72,1,72,7],[72,8,72,11],[72,12,72,15],[67,8,67,11],[73,1,73,7],[73,12,73,15],[55,2,55,3],[55,4,55,5],[56,10,56,11],[56,12,56,16],[66,8,66,11],[67,2,67,4],[60,1,61,1],[60,2,60,4],[56,3,56,9],[60,8,60,11]]}
["４．加算措置"]
[null,"加算措置に取り組む場合は以下を記入してください。取り組まない場合、本項目に係るページは提出不要です。"]
[]
[null,"加算一覧",null,null,null,null,null,null,null,null,null,null,"計画"]
[null,"多面的機能の更なる増進に向けた活動への支援",null,null,null,null,null,null,null,null,null,null,null,"→（１）へ",null,null,null,null,null,null,null,null,null,"（通称：増進加算）"]
[null,"農村協働力の深化に向けた活動への支援",null,null,null,null,null,null,null,null,null,null,null,"→（２）へ",null,null,null,null,null,null,null,null,null,"（令和６年度廃止（令和10年度までの経過措置））"]
[null,"水田の貯留機能の強化（田んぼダム）を推進する活動への支援",null,null,null,null,null,null,null,null,null,null,null,"→（５）へ",null,null,null,null,null,null,null,null,null,"（通称：田んぼダム加算）"]
[null,"環境負荷低減の取組への支援",null,null,null,null,null,null,null,null,null,null,null,"→別葉（６）へ",null,null,null,null,null,null,null,null,null,"（通称：みどり加算）"]
[null,"組織の体制強化に対する支援",null,null,null,null,null,null,null,null,null,null,null,"→（３）へ",null,null,null,null,null,null,null,null,null,"（通称：活動支援班加算）"]
[null,"組織の広域化・体制強化に対する支援",null,null,null,null,null,null,null,null,null,null,null,"→（４）へ",null,null,null,null,null,null,null,null,null,"（令和６年度廃止（令和10年度までの経過措置））"]
[]
["（１）多面的機能の更なる増進に向けた活動への支援"]
[null,"★適用条件\n活動を継続する組織　…（本事業計画の活動項目数）＞（前年度又は変更前の活動項目数）\n新規の組織　　　　　…　本事業計画の活動項目数２つ以上"]
[]
[null,"多面的機能の増進を図る活動の活動項目",null,null,null,null,null,null,null,null,null,null,null,null,"↓ 活動を継続する組織のみ記入"]
[null,"項目",null,null,null,null,null,null,null,null,null,"本事業計画の活動",null,null,"前年度又は変更前の活動"]
[null,"52 遊休農地の有効活用",null,null,null,null,null,null,null,null,null,{"$f":"IF('別紙1 活動計画書'!O144=\"○\",\"○\",\"\")","v":""}]
[null,"53 鳥獣被害防止対策及び環境改善活動の強化",null,null,null,null,null,null,null,null,null,{"$f":"IF('別紙1 活動計画書'!O145=\"○\",\"○\",\"\")","v":""}]
[null,"54 地域住民による直営施工",null,null,null,null,null,null,null,null,null,{"$f":"IF('別紙1 活動計画書'!O146=\"○\",\"○\",\"\")","v":""}]
[null,"55 防災・減災力の強化",null,null,null,null,null,null,null,null,null,{"$f":"IF('別紙1 活動計画書'!O147=\"○\",\"○\",\"\")","v":""}]
[null,"56 農村環境保全活動の幅広い展開",null,null,null,null,null,null,null,null,null,{"$f":"IF('別紙1 活動計画書'!O148=\"○\",\"○\",\"\")","v":""}]
[null,"57 やすらぎ・福祉及び教育機能の活用",null,null,null,null,null,null,null,null,null,{"$f":"IF('別紙1 活動計画書'!O149=\"○\",\"○\",\"\")","v":""}]
[null,"58 農村文化の伝承を通じた農村コミュニティの強化",null,null,null,null,null,null,null,null,null,{"$f":"IF('別紙1 活動計画書'!O150=\"○\",\"○\",\"\")","v":""}]
[null,"58-2 広域活動組織における活動支援班による活動の実施",null,null,null,null,null,null,null,null,null,{"$f":"IF('別紙1 活動計画書'!O151=\"○\",\"○\",\"\")","v":""}]
[null,"58-3 水管理を通じた環境負荷低減活動の強化",null,null,null,null,null,null,null,null,null,{"$f":"IF('別紙1 活動計画書'!O152=\"○\",\"○\",\"\")","v":""}]
[null,"59 都道府県、市町村が特に認める活動",null,null,null,null,null,null,null,null,null,{"$f":"IF('別紙1 活動計画書'!O153=\"○\",\"○\",\"\")","v":""}]
[]
[]
[null,"地目","対象農用地面積",null,null,"交付単価",null,null,"年当たり交付金額",null,null,null,null,"※対象農用地面積とは、交付金の算定の対象となる農用地の面積のことです。小数点以下を切り捨て、整数で記入してください。"]
[null,"田",null,null,null,null,null,null,{"$f":"INT(C30*F30/10)","v":0}]
[null,null,{"$f":"IF($M$5=\"○\",'別紙1 活動計画書'!C21,\"\")","v":""},null,null,{"$f":"IF('はじめに（PC）'!$D$2=\"北海道\",'【参考】交付単価（PC）'!Q15,'【参考】交付単価（PC）'!O15)","v":400},null,"円/10a",{"$f":"IFERROR(INT(C31*F31/10),\"\")","v":""}]
[null,"畑",null,null,null,null,null,null,{"$f":"INT(C32*F32/10)","v":0},null,null,null,null,"※資源向上支払（共同）の交付単価の減額条件に該当する場合は、本加算措置の交付単価も同様に減額されます。"]
[null,null,{"$f":"IF($M$5=\"○\",'別紙1 活動計画書'!C23,\"\")","v":""},null,null,{"$f":"IF('はじめに（PC）'!$D$2=\"北海道\",'【参考】交付単価（PC）'!Q16,'【参考】交付単価（PC）'!O16)","v":240},null,"円/10a",{"$f":"IFERROR(INT(C33*F33/10),\"\")","v":""}]
[null,"草地",null,null,null,null,null,null,0]
[null,null,{"$f":"IF($M$5=\"○\",'別紙1 活動計画書'!C25,\"\")","v":""},null,null,{"$f":"IF('はじめに（PC）'!$D$2=\"北海道\",'【参考】交付単価（PC）'!Q17,'【参考】交付単価（PC）'!O17)","v":40},null,"円/10a",{"$f":"IFERROR(INT(C35*F35/10),\"\")","v":""}]
[null,"合計",{"$f":"INT(SUM(C30,C32,C34))","v":0},null,null,null,null,null,{"$f":"SUM(I30,I32,I34)","v":0}]
[null,null,{"$f":"INT(SUM(C31,C33,C35))","v":0},null,null,null,null,null,{"$f":"SUM(I31,I33,I35)","v":0}]
[]
["（２）農村協働力の深化に向けた活動への支援（令和６年度廃止（令和10年度までの経過措置））"]
[null,"適用条件の確認"]
[null,"①　多面的機能の更なる増進に向けた活動への支援を受ける"]
[null,"②　農業者以外の割合"]
[null,"・","組織の構成員"]
[null,null,null,null,"農業者",null,null,"個人",0,null,"+団体",null,0,null,"=",{"$f":"I44+M44","v":0}]
[null,null,null,null,"農業者以外",null,null,"個人",0,null,"+団体",null,0,null,"=",{"$f":"I45+M45","v":0},null,null,null,null,"･･･①"]
[]
[null,null,null,null,"合計",null,null,"個人",{"$f":"I44+I45","v":0},null,"+団体",null,{"$f":"M44+M45","v":0},null,"=",{"$f":"I47+M47","v":0},null,null,null,null,"･･･②"]
[]
[null,"・","農業者以外の割合",null,null,null,{"$f":"IFERROR(P45/P47,\"%\")","v":"%"},null,null,"・・・ ①／②"]
[null,"③－１　共同活動に参加する構成員の総人数の８割が参加する実践活動の実施 "]
[null,null,"　個人",null,{"$f":"I47","v":0},null,"+ 団体の構成員のうち、共同活動に参加する人数",null,null,null,null,null,null,null,null,null,0]
[null,null,"=","共同活動に参加する構成員の総人数",null,null,null,null,null,null,{"$f":"E51+Q51","v":0},null,"のうち、８割にあたる",null,null,null,null,{"$f":"ROUNDUP(K52*0.8,0)","v":0},null,"以上が"]
[null,null,"参加する実践活動を毎年度行う。"]
[null,"③－２　あるいは、役員に女性が",null,null,null,null,null,0,"選任されていて、共同活動に参加する構成員の総人数の６割が"]
[null,"　　　　参加する実践活動を、２種以上、それぞれ別の日に実施"]
[null,null,"　個人",null,{"$f":"I47","v":0},null,"+ 団体の構成員のうち、共同活動に参加する人数",null,null,null,null,null,null,null,null,null,0]
[null,null,"=","共同活動に参加する構成員の総人数",null,null,null,null,null,null,{"$f":"E56+Q56","v":0},null,"のうち、6割にあたる",null,null,null,null,{"$f":"ROUNDUP(K57*0.6,0)","v":0},null,"以上が"]
[null,null,"参加する実践活動を、２種以上、それぞれ別の日に毎年度行う。"]
[null,"③－１、２いずれの場合も、共同活動に参加する構成員の総人数の内訳がわかる名簿（様式自由）を添付してください。"]
[null,"地目","対象農用地面積",null,null,"交付単価",null,null,"年当たり交付金額",null,null,null,null,"★ 農村協働力の深化に向けた活動への支援の適用条件\n\n○多面的機能の更なる増進に向けた活動への支援を受けること\n\n○構成員の農業者以外の割合　４割以上\n\n○共同活動に参加する構成員の総人数（※）の８割以上が参加する実践活動を行うこと、あるいは女性役員が２名以上の組織で構成員の総人数の６割以上が参加する実践活動を複数回行うこと\n※構成員個人と、団体の構成員のうち共同活動に参加する人数の合計"]
[null,"田",null,null,null,null,null,null,{"$f":"INT(C61*F61/10)","v":0}]
[null,null,{"$f":"IF($M$6=\"○\",'別紙1 活動計画書'!C21,\"\")","v":""},null,null,{"$f":"IF('はじめに（PC）'!$D$2=\"北海道\",'【参考】交付単価（PC）'!Q21,'【参考】交付単価（PC）'!O21)","v":400},null,"円/10a",{"$f":"IFERROR(INT(C62*F62/10),\"\")","v":""}]
[null,"畑",null,null,null,null,null,null,0]
[null,null,{"$f":"IF($M$6=\"○\",'別紙1 活動計画書'!C23,\"\")","v":""},null,null,{"$f":"IF('はじめに（PC）'!$D$2=\"北海道\",'【参考】交付単価（PC）'!Q22,'【参考】交付単価（PC）'!O22)","v":240},null,"円/10a",{"$f":"IFERROR(INT(C64*F64/10),\"\")","v":""}]
[null,"草地",null,null,null,null,null,null,0]
[null,null,{"$f":"IF($M$6=\"○\",'別紙1 活動計画書'!C25,\"\")","v":""},null,null,{"$f":"IF('はじめに（PC）'!$D$2=\"北海道\",'【参考】交付単価（PC）'!Q23,'【参考】交付単価（PC）'!O23)","v":40},null,"円/10a",{"$f":"IFERROR(INT(C66*F66/10),\"\")","v":""}]
[null,"合計",{"$f":"INT(SUM(C61,C63,C65))","v":0},null,null,null,null,null,{"$f":"SUM(I61,I63,I65)","v":0}]
[null,null,{"$f":"INT(SUM(C62,C64,C66))","v":0},null,null,null,null,null,{"$f":"SUM(I62,I64,I66)","v":0}]
[null,"※対象農用地面積とは、交付金の算定の対象となる農用地の面積のことです。小数点以下を切り捨て、整数で記入してください。"]
[null,"※資源向上支払（共同）の交付単価の減額条件に該当する場合は、本加算措置の交付単価も同様に減額されます。"]
[]
["（３）組織の体制強化に対する支援"]
[null,"区分",null,null,null,null,null,null,"交付年度",null,null,null,"交付額"]
[null,"広域活動組織の設立及び活動支援班の設置",null,null,null,null,null,null,"令和",null,"年度",null,400000]
[]
["（４）組織の広域化・体制強化に対する支援（令和６年度廃止（令和10年度までの経過措置））"]
[null,"区分",null,null,null,null,null,null,"該当するものに○",null,null,null,"交付額"]
[null,"３集落以上\n又は50ha以上200ha未満",null,null,null,null,null,null,null,null,null,null,40000]
[null,"200ha以上1,000ha未満\n又は特定非営利活動法人",null,null,null,null,null,null,null,null,null,null,80000]
[null,"1,000ha以上",null,null,null,null,null,null,null,null,null,null,160000]
[null,"※北海道にあっては、３集落以上又は1,500ha以上3,000ha未満のとき40,000円／年・組織、3,000ha以上15,000ha未満又は特定非営利活動法人のとき80,000円／年・組織、15,000ha以上のとき160,000円／年・組織に置き換える。"]
[null,"※特定非営利活動法人の加算措置を受ける場合は、特定非営利活動促進法第13条第２項の登記事項証明書の写しを提出してください。"]
["（５）水田の雨水貯留機能の強化（田んぼダム）を推進する活動への支援"]
[null,"★適用条件\n①資源向上支払（共同）の交付を受ける田面積のうち５割以上において、雨水貯留機能の強化 （田んぼダム）を\n　推進する活動を行っていること。\n②広域活動組織にあっては、本活動を実施する集落ごとに、資源向上支払（共同）の交付を受ける水田面積のうち\n　５割以上において、雨水貯留機能の強化 （田んぼダム）を推進する活動を行っていること。\n　（実施しない集落の面積は対象農用地面積より除くこと。）"]
[]
[null,"a　実施期間"]
[null,"開始年度",null,null,null,"最終年度",null,null,null,"※最終年度は、資源向上（共同）の活動終了年度と同じです。"]
[null,"令和",null,null,"年度","令和",null,"年度"]
[]
[null,"ｂ　実施計画"]
[null,"年度",null,null,null,"年次計画・実施体制等"]
[null,"令和",{"$f":"IF(C88=\"\",\"\",C88)","v":""},null,"年度"]
[null,"令和",{"$f":"IF((G88-C88)>0,C92+1,\"\")","v":""},null,"年度"]
[null,"令和",{"$f":"IF((G88-C88)>1,C93+1,\"\")","v":""},null,"年度"]
[null,"令和",{"$f":"IF((G88-C88)>2,C94+1,\"\")","v":""},null,"年度"]
[null,"令和",{"$f":"IF((G88-C88)>3,C95+1,\"\")","v":""},null,"年度"]
[]
[null,"c　最終年度における実施面積及び加算額"]
[null,"地目","全対象農用地面積",null,null,null,null,null,null,"交付単価",null,null,null,null,"年当たりの\n加算額",null,null,null,"実施面積の\n割合"]
[null,null,null,null,null,null,"うち、実施面積"]
[null,"田",{"$f":"IF($M$7=\"○\",'別紙1 活動計画書'!C21,\"\")","v":""},null,null,null,0,null,null,{"$f":"IF('はじめに（PC）'!$D$2=\"北海道\",'【参考】交付単価（PC）'!Q27,'【参考】交付単価（PC）'!O27)","v":400},null,null,"円/10a",null,{"$f":"IFERROR(C101*J101/10,\"\")","v":""},null,null,null,{"$f":"IF(G101>0,G101/C101,0)","v":0}]
[]
[null,"※資源向上支払（共同）の交付単価の減額条件に該当する場合は、本加算措置の交付単価も同様に減額されます。"]
[]
[null,"（参考）広域活動組織における集落ごとの実施面積と割合"]
[null,"集落名",null,null,null,null,"対象農用地面積",null,null,null,null,null,null,null,"実施面積の\n割合",null,null,null,"備考"]
[null,null,null,null,null,null,null,null,null,null,"うち、実施面積"]
[null,null,null,null,null,null,null,null,null,"a",null,null,null,"a",{"$f":"IF(K108>0,K108/G108,0)","v":0}]
[]
[null,null,null,null,null,null,null,null,null,"a",null,null,null,"a",{"$f":"IF(K110>0,K110/G110,0)","v":0}]
[]
[null,null,null,null,null,null,null,null,null,"a",null,null,null,"a",{"$f":"IF(K112>0,K112/G112,0)","v":0}]
[]
[null,null,null,null,null,null,null,null,null,"a",null,null,null,"a",{"$f":"IF(K114>0,K114/G114,0)","v":0}]
[]
[]
[null,"d　活動実施区域位置図"]
[null,null,"別添３「田んぼダム実施区域位置図」のとおり"]
[null,"　※なお、別添１「実施区域位置図」に田んぼダム実施区域位置を記載している場合、別添３は省略できる。"]

{"sheet":"加算措置（みどり加算）","index":5,"n_rows":53,"n_cols":34,"rows_kept":53,"cut":false,"hidden":false,"merged":[[40,1,40,3],[12,2,12,6],[12,12,12,16],[1,1,1,7],[4,2,4,4],[8,2,10,11],[8,12,10,21],[11,2,11,6],[11,7,11,11],[11,12,11,16],[11,17,11,21],[4,5,4,7],[16,2,16,6],[16,12,16,16],[17,2,17,6],[17,12,17,16],[18,2,18,6],[18,12,18,16],[13,2,13,6],[13,12,13,16],[14,2,14,6],[14,12,14,16],[15,2,15,6],[15,12,15,16],[27,24,27,26],[27,1,27,3],[27,4,27,5],[27,6,27,7],[27,8,27,9],[27,10,27,11],[19,2,19,6],[19,12,19,16],[20,2,20,6],[20,12,20,16],[23,2,23,6],[23,12,23,16],[21,2,21,6],[21,12,21,16],[22,2,22,6],[22,12,22,16],[32,24,33,26],[32,27,33,29],[32,30,33,32],[32,33,33,36],[27,27,27,29],[27,30,27,32],[27,33,27,36],[28,1,29,3],[28,4,29,5],[28,6,29,7],[28,8,29,9],[28,10,29,11],[28,12,29,13],[28,14,29,15],[28,16,29,17],[28,18,29,20],[28,21,29,23],[28,24,29,26],[28,27,29,29],[28,30,29,32],[27,12,27,13],[27,14,27,17],[27,18,27,20],[27,21,27,23],[28,33,29,36],[30,1,31,3],[30,4,31,5],[30,6,31,7],[30,8,31,9],[30,10,31,11],[30,12,31,13],[30,14,31,15],[30,16,31,17],[30,18,31,20],[30,21,31,23],[30,24,31,26],[30,27,31,29],[30,30,31,32],[30,33,31,36],[32,12,33,13],[32,14,33,15],[32,16,33,17],[32,18,33,20],[32,21,33,23],[32,1,33,3],[32,4,33,5],[32,6,33,7],[34,1,35,3],[34,4,35,5],[34,6,35,7],[34,8,35,9],[34,10,35,11],[34,12,35,13],[34,14,35,15],[34,16,35,17],[34,18,35,20],[32,8,33,9],[32,10,33,11],[38,10,39,11],[34,30,35,32],[34,33,35,36],[36,1,37,3],[36,4,37,5],[36,6,37,7],[36,8,37,9],[36,10,37,11],[36,12,37,13],[36,14,37,15],[36,16,37,17],[36,18,37,20],[36,21,37,23],[36,24,37,26],[36,27,37,29],[36,30,37,32],[36,33,37,36],[34,21,35,23],[34,24,35,26],[34,27,35,29],[38,1,39,3],[40,33,40,36],[38,24,39,26],[38,27,39,29],[38,30,39,32],[38,33,39,36],[40,4,40,5],[40,6,40,7],[40,8,40,9],[40,10,40,11],[40,12,40,13],[40,14,40,16],[40,18,40,20],[40,21,40,23],[40,24,40,26],[40,27,40,29],[40,30,40,32],[38,12,39,13],[38,14,39,15],[38,16,39,17],[38,18,39,20],[38,21,39,23],[38,4,39,5],[38,6,39,7],[38,8,39,9]]}
[null,"（別葉）"]
[null,"（６）環境負荷低減の取組への支援"]
[]
[null,"a　 実施期間"]
[null,null,"開始年度",null,null,"最終年度",null,null,null,"※最終年度は、資源向上（共同）の活動終了年度と同じです。"]
[null,null,"令和",null,"年度","令和",null,"年度"]
[]
[null,"ｂ　実施時期"]
[null,null,"取組項目",null,null,null,null,null,null,null,null,null,"化学肥料及び化学合成農薬を\n5割以上低減する活動"]
[]
[]
[null,null,"内容",null,null,null,null,"実施時期",null,null,null,null,"作物名",null,null,null,null,"栽培時期"]
[null,null,null,null,null,null,null,null,"月","～",null,"月",null,null,null,null,null,null,"月","～",null,"月"]
[null,null,null,null,null,null,null,null,"月","～",null,"月",null,null,null,null,null,null,"月","～",null,"月"]
[null,null,null,null,null,null,null,null,"月","～",null,"月",null,null,null,null,null,null,"月","～",null,"月"]
[null,null,null,null,null,null,null,null,"月","～",null,"月",null,null,null,null,null,null,"月","～",null,"月"]
[null,null,null,null,null,null,null,null,"月","～",null,"月",null,null,null,null,null,null,"月","～",null,"月"]
[null,null,null,null,null,null,null,null,"月","～",null,"月",null,null,null,null,null,null,"月","～",null,"月"]
[null,null,null,null,null,null,null,null,"月","～",null,"月",null,null,null,null,null,null,"月","～",null,"月"]
[null,null,null,null,null,null,null,null,"月","～",null,"月",null,null,null,null,null,null,"月","～",null,"月"]
[null,null,null,null,null,null,null,null,"月","～",null,"月",null,null,null,null,null,null,"月","～",null,"月"]
[null,null,null,null,null,null,null,null,"月","～",null,"月",null,null,null,null,null,null,"月","～",null,"月"]
[null,null,null,null,null,null,null,null,"月","～",null,"月",null,null,null,null,null,null,"月","～",null,"月"]
[null,null,null,null,null,null,null,null,"月","～",null,"月",null,null,null,null,null,null,"月","～",null,"月"]
[null,null,"※必要に応じて欄を追加してください。"]
[]
[null,"c　活動の計画"]
[null,"取組項目",null,null,"１年目\n計画面積\n（畦畔除く）",null,"２年目\n計画面積\n（畦畔除く）",null,"３年目\n計画面積\n（畦畔除く）",null,"４年目\n計画面積\n（畦畔除く）",null,"５年目\n計画面積\n（畦畔除く）",null,"交付単価",null,null,null,"１年目\n交付上限額",null,null,"２年目\n交付上限額",null,null,"３年目\n交付上限額",null,null,"４年目\n交付上限額",null,null,"５年目\n交付上限額",null,null,"備考"]
[null,"長期中干し",null,null,0,null,0,null,0,null,0,null,0,null,800,null,"円/10a",null,{"$f":"E29*O29/10","v":0},null,null,{"$f":"G29*O29/10","v":0},null,null,{"$f":"I29*O29/10","v":0},null,null,{"$f":"K29*O29/10","v":0},null,null,{"$f":"M29*O29/10","v":0}]
[]
[null,"冬期湛水",null,null,0,null,0,null,0,null,0,null,0,null,4000,null,"円/10a",null,{"$f":"E31*O31/10","v":0},null,null,{"$f":"G31*O31/10","v":0},null,null,{"$f":"I31*O31/10","v":0},null,null,{"$f":"K31*O31/10","v":0},null,null,{"$f":"M31*O31/10","v":0}]
[]
[null,"夏期湛水",null,null,0,null,0,null,0,null,0,null,0,null,8000,null,"円/10a",null,{"$f":"E33*O33/10","v":0},null,null,{"$f":"G33*O33/10","v":0},null,null,{"$f":"I33*O33/10","v":0},null,null,{"$f":"K33*O33/10","v":0},null,null,{"$f":"M33*O33/10","v":0}]
[]
[null,"中干し延期",null,null,0,null,0,null,0,null,0,null,0,null,3000,null,"円/10a",null,{"$f":"E35*O35/10","v":0},null,null,{"$f":"G35*O35/10","v":0},null,null,{"$f":"I35*O35/10","v":0},null,null,{"$f":"K35*O35/10","v":0},null,null,{"$f":"M35*O35/10","v":0}]
[]
[null,"江の設置等\n（作溝実施）",null,null,0,null,0,null,0,null,0,null,0,null,4000,null,"円/10a",null,{"$f":"E37*O37/10","v":0},null,null,{"$f":"G37*O37/10","v":0},null,null,{"$f":"I37*O37/10","v":0},null,null,{"$f":"K37*O37/10","v":0},null,null,{"$f":"M37*O37/10","v":0}]
[]
[null,"江の設置等\n（作溝未実施）",null,null,0,null,0,null,0,null,0,null,0,null,3000,null,"円/10a",null,{"$f":"E39*O39/10","v":0},null,null,{"$f":"G39*O39/10","v":0},null,null,{"$f":"I39*O39/10","v":0},null,null,{"$f":"K39*O39/10","v":0},null,null,{"$f":"M39*O39/10","v":0}]
[]
[null,"合計",null,null,{"$f":"SUM(E29:F40)","v":0},null,{"$f":"SUM(G29:H40)","v":0},null,{"$f":"SUM(I29:J40)","v":0},null,{"$f":"SUM(K29:L40)","v":0},null,{"$f":"SUM(M29:N40)","v":0},null,null,null,null,null,{"$f":"SUM(S29:U40)","v":0},null,null,{"$f":"SUM(V29:X40)","v":0},null,null,{"$f":"SUM(Y29:AA40)","v":0},null,null,{"$f":"SUM(AB29:AD40)","v":0},null,null,{"$f":"SUM(AE29:AG40)","v":0}]
[null,"※ 計画面積は、対象活動別（同一の対象活動であっても、単価毎）に、a未満を切り捨てた値を記載すること。"]
[null,"※ 計画面積は、取組ごとに、２年目以降の取組面積が初年度の取組面積を下回らず、終了年度の取組面積が初年度の取組面積を上回る必要があります。"]
[null,"※ 資源向上支払（共同）の活動期間の途中からみどり加算に取り組む場合は、当該活動期間中の実施計画のみを記入します。"]
[]
[null,"d　活動実施区域位置図"]
[null,null,"別添４「環境負荷低減の取組実施区域位置図」のとおり"]
[null,"　※なお、別添１「実施区域位置図」に環境負荷低減の取組実施区域を記載している場合、別添４は省略できます。"]
[]
[null,"e　（特定事業実施者のみ）添付書類"]
[null,null,"特定事業実施者の場合であって、"]
[null,null,"　農業者の組織する団体の場合、規約など令和６年度に環境保全型農業直接支払交付金の交付を受けていたことが分かる書類"]
[null,null,"　一定の要件を満たす農業者の場合、一定の要件を満たし令和６年度に環境保全型農業直接支払交付金の交付を受けていたことが分かる書類"]

{"sheet":"別添1 位置図","index":6,"n_rows":3,"n_cols":8,"rows_kept":3,"cut":false,"hidden":false,"merged":[]}
[null,"（別添１）"]
[null,"実施区域位置図",null,null,null,null,null,"組織名称："]
[null,{"$f":"#REF!","v":{"$error":"#REF!"}},"１号事業（多面支払）",{"$f":"#REF!","v":{"$error":"#REF!"}},"2号事業（中山間直払）",{"$f":"#REF!","v":{"$error":"#REF!"}},"３号事業（環境直払）",{"$f":"'はじめに（PC）'!D4&\"\"","v":"○○・・・・・・活動組織"}]

{"sheet":"別添3 位置図","index":7,"n_rows":32,"n_cols":10,"rows_kept":32,"cut":false,"hidden":false,"merged":[]}
[null,"（別添３）"]
[null,"田んぼダム実施区域位置図",null,null,null,null,null,null,null,"活動組織名称："]
[null,null,null,null,null,null,null,null,null,{"$f":"'はじめに（PC）'!D4&\"\"","v":"○○・・・・・・活動組織"}]
[]
[]
[]
[]
[]
[]
[]
[]
[]
[]
[]
[]
[]
[]
[]
[]
[]
[]
[]
[]
[]
[]
[]
[]
[]
[]
[]
[]
[null,null,"注１）　別添１「実施区域位置図」に田んぼダム実施区域位置を記載している場合、本様式は省略ができる。"]

{"sheet":"別添4 位置図","index":8,"n_rows":32,"n_cols":10,"rows_kept":32,"cut":false,"hidden":false,"merged":[]}
[null,"（別添４）"]
[null,"環境負荷低減の取組実施区域位置図",null,null,null,null,null,null,null,"活動組織名称："]
[null,null,null,null,null,null,null,null,null,{"$f":"'はじめに（PC）'!D4&\"\"","v":"○○・・・・・・活動組織"}]
[]
[]
[]
[]
[]
[]
[]
[]
[]
[]
[]
[]
[]
[]
[]
[]
[]
[]
[]
[]
[]
[]
[]
[]
[]
[]
[]
[]
[null,null,"注１）　別添１「実施区域位置図」に環境負荷低減の取組実施区域位置を記載している場合、本様式は省略ができる。"]

{"sheet":"【選択肢】","index":9,"n_rows":245,"n_cols":24,"rows_kept":245,"cut":false,"hidden":false,"merged":[[20,23,21,25],[16,2,16,6],[0,0,0,13],[0,16,0,20],[0,21,1,21],[0,22,1,22],[1,18,1,19],[1,5,1,9]]}
[null,null,null,null,null,null,null,null,null,null,null,null,null,null,null,null,"活動記録で選択された取組番号から、区分、項目、取組を自動入力するための表",null,null,null,null,"実施回数のカウント","←活動記録に取組番号が入力された回数をカウントし、これをもとに実施状況報告書の「実施欄」の○、×を判定しています。","都道府県の要綱基本方針において取組を追加した場合の設定方法（県の担当者が作業してください）"]
["A.■か□","B.○か空白","C.○か－か×","D.農村環境保全活動のテーマ","E.高度な保全活動","F.施設（長寿命化）",null,null,null,null,"G.単位","H.構成員一覧の分類","I.金銭出納簿の区分","J.金銭出納簿の収支の分類",null,"プルダウン用","番号","支払区分","活動項目",null,"取組",null,null,"要綱基本方針において取組を追加した場合、以下の方法により修正することができます。"]
["■","○","○","生態系保全","循環かんがいによる水質保全","水路","61　水路の補修","62　水路の更新等","107 水路法面の補修","108 取水施設の補修","km","１.農業者個人",1,"１.前年度持越",null,"○",200,"-","事務処理","事務処理","200 事務処理",null,null,"●共通：活動記録で、追加した取組番号を入力できるようにする"]
["□",null,"－","水質保全","浄化水路による水質保全","農道","63　農道の補修","64　農道の更新等",null,null,"箇所","２.農事組合法人",2,"２.交付金",null,"○",300,"-","会議","会議","300 会議",null,null,"　１）「取組番号早見表シート」及び「取組番号シート」に番号、支払区分、活動項目、取組を追加する。"]
[null,null,"×","景観形成・生活環境保全","地下水かん養","ため池","65　ため池の補修","66　ため池（附帯施設）の更新等",null,null,null,"３.営農組合",null,"３.利子等",null,null,null,null,null,null,null,null,null,"　２）「選択肢」シートのP列～T列の74行以降に行を挿入し、追加した取組番号、支払区分、活動項目、取組を入力する。"]
[null,null,null,"水田貯留・地下水かん養","持続的な水管理","農地に係る施設","109 農地に係る施設の補修","110 農地に係る施設の更新等","111 農用地進入路の更新等",null,null,"４.その他の農業者団体",null,"４.日当",null,{"$f":"'別紙1 活動計画書'!M72","v":0},1,"農地維持","点検・計画策定","点検","1 点検",{"$f":"COUNTIF(#REF!,【選択肢】!Q6)","v":{"$error":"#REF!"}},null,"　３）「選択肢」シートU列の74行以降にU73セル（活動記録に入力された回数のカウントを行う数式）をコピーする。　"]
[null,null,null,"資源循環","土壌流出防止",null,null,null,null,null,null,"５.農業者以外個人",null,"５.外注費",null,{"$f":"'別紙1 活動計画書'!M73","v":0},2,"農地維持","点検・計画策定","計画策定","2 年度活動計画の策定",{"$f":"COUNTIF(#REF!,【選択肢】!Q7)","v":{"$error":"#REF!"}},null,"　　　（この作業により、活動記録に取組番号が入力された回数がＰ列に入力され、これをもとに実施状況報告書の「実施欄」の○、×を判定します。）"]
[null,null,null,null,"生物多様性の回復",null,null,null,null,null,null,"６.自治会",null,"６.その他支出",null,"○",3,"農地維持","研修","研修","3 事務・組織運営等に関する研修、機械の安全使用に関する研修",{"$f":"COUNTIF(#REF!,【選択肢】!Q8)","v":{"$error":"#REF!"}}]
[null,null,null,null,"水環境の回復",null,null,null,null,null,null,"７.女性会",null,"７.返還",null,{"$f":"'別紙1 活動計画書'!M75","v":0},4,"農地維持","実践活動","農用地","4 遊休農地発生防止のための保全管理",{"$f":"COUNTIF(#REF!,【選択肢】!Q9)","v":{"$error":"#REF!"}},null,"●農村環境保全活動、多面的機能の増進を図る活動、長寿命化のための活動を追加する場合は以下の設定を行う"]
[null,null,null,null,"持続的な畦畔管理",null,null,null,null,null,null,"８.子供会",null,null,null,{"$f":"'別紙1 活動計画書'!M76","v":0},5,"農地維持","実践活動","農用地","5 畦畔・法面・防風林の草刈り",{"$f":"COUNTIF(#REF!,【選択肢】!Q10)","v":{"$error":"#REF!"}},null,"①農村環境保全活動の項目を追加する場合"]
[null,null,null,null,"専門家の指導",null,null,null,null,null,null,"９.土地改良区",null,null,null,"○",6,"農地維持","実践活動","農用地","6 鳥獣害防護柵等の保守管理",{"$f":"COUNTIF(#REF!,【選択肢】!Q11)","v":{"$error":"#REF!"}},null,"活動計画書３（２）１）で実践活動を選択する際に、追加した項目を選択できるようにする"]
[null,null,null,null,null,null,null,null,null,null,null,"10.JA",null,null,null,{"$f":"'別紙1 活動計画書'!M79","v":0},7,"農地維持","実践活動","水路","7 水路の草刈り",{"$f":"COUNTIF(#REF!,【選択肢】!Q12)","v":{"$error":"#REF!"}},null,"　１）「選択肢」シートのV列の「50　地域資源の活用・資源循環活動（資源循環）」の下に取組名を入力する。"]
[null,null,null,null,null,null,null,null,null,null,null,"11.学校・PTA",null,null,null,{"$f":"'別紙1 活動計画書'!M80","v":0},8,"農地維持","実践活動","水路","8 水路の泥上げ",{"$f":"COUNTIF(#REF!,【選択肢】!Q13)","v":{"$error":"#REF!"}},null,"　　　　このとき、「●共通」で入力した取組名と同じになるように注意してください。"]
[null,null,null,null,null,null,null,null,null,null,null,"12.NPO",null,null,null,"○",9,"農地維持","実践活動","水路","9 水路附帯施設の保守管理",{"$f":"COUNTIF(#REF!,【選択肢】!Q14)","v":{"$error":"#REF!"}},null,"　２）「数式」タブの「名前の管理」を選択し、リストの中から「K.農村環境保全活動」を選択し、「参照範囲」の右のアイコンをクリック"]
[null,null,null,null,null,null,null,null,null,null,null,"13.その他の農業者以外団体",null,null,null,{"$f":"'別紙1 活動計画書'!M83","v":0},10,"農地維持","実践活動","農道","10 農道の草刈り",{"$f":"COUNTIF(#REF!,【選択肢】!Q15)","v":{"$error":"#REF!"}},null,"　３）参照範囲に追加した取組を含むよう範囲を選択し直し、確定する。"]
[null,null,null,null,null,null,null,null,null,null,null,null,null,null,null,"○",11,"農地維持","実践活動","農道","11 農道側溝の泥上げ",{"$f":"COUNTIF(#REF!,【選択肢】!Q16)","v":{"$error":"#REF!"}}]
["N.月","O.環境負荷低減の取組","作物",null,null,null,null,"P.時間","Q.チェック",null,null,null,null,null,null,"○",12,"農地維持","実践活動","農道","12 路面の維持",{"$f":"COUNTIF(#REF!,【選択肢】!Q17)","v":{"$error":"#REF!"}},null,"②多面的機能の増進を図る活動の項目を追加する場合"]
[1,"長期中干し","水稲",null,null,null,null,0.5,"☑",null,null,null,null,null,null,{"$f":"'別紙1 活動計画書'!M86","v":0},13,"農地維持","実践活動","ため池","13 ため池の草刈り",{"$f":"COUNTIF(#REF!,【選択肢】!Q18)","v":{"$error":"#REF!"}},null,"②-1　活動計画書３（２）２）で都道府県、市町村が認める具体的な活動の内容を入力できるようにする"]
[2,"冬期湛水","水稲",null,null,null,null,1,"□",null,null,null,null,null,null,"○",14,"農地維持","実践活動","ため池","14 ため池の泥上げ",{"$f":"COUNTIF(#REF!,【選択肢】!Q19)","v":{"$error":"#REF!"}},null,"　１）「活動計画書」シートの147行目の「59　都道府県、市町村が特に認める活動」の下に行を挿入し、取組名を入力する。"]
[3,"夏期湛水","野菜","イモ類","麦類","豆類","なたね類",1.5,null,null,null,null,null,null,null,"○",15,"農地維持","実践活動","ため池","15 ため池附帯施設の保守管理",{"$f":"COUNTIF(#REF!,【選択肢】!Q20)","v":{"$error":"#REF!"}},null,"　　　　このとき、「●共通」で入力した取組名と同じになるように注意してください。"]
[4,"中干し延期","水稲",null,null,null,null,2,null,null,null,null,null,null,null,"○",16,"農地維持","実践活動","共通","16 異常気象時の対応",{"$f":"COUNTIF(#REF!,【選択肢】!Q21)","v":{"$error":"#REF!"}},null,"　　　　２）報告書においても同様に活動項目「59　都道府県、市町村が特に認める活動」の下に行を挿入して取組名を入力し、\n　　　　　　　「計画」「実施」欄については、「59　都道府県、市町村が特に認める活動」の「計画」「実施」欄にある数式をコピーする。"]
[5,"江の設置_作溝実施","水稲",null,null,null,null,2.5,null,null,null,null,null,null,null,{"$f":"'別紙1 活動計画書'!B108","v":0},17,"農地維持","推進活動","推進活動","17 農業者の検討会の開催",{"$f":"COUNTIF(#REF!,【選択肢】!Q22)","v":{"$error":"#REF!"}}]
[6,"江の設置_作溝未実施","水稲",null,null,null,null,3,null,null,null,null,null,null,null,{"$f":"'別紙1 活動計画書'!B109","v":0},18,"農地維持","推進活動","推進活動","18 農業者に対する意向調査、現地調査",{"$f":"COUNTIF(#REF!,【選択肢】!Q23)","v":{"$error":"#REF!"}}]
[7,null,null,null,null,null,null,3.5,null,null,null,null,null,null,null,{"$f":"'別紙1 活動計画書'!B110","v":0},19,"農地維持","推進活動","推進活動","19 不在村地主との連絡体制の整備等",{"$f":"COUNTIF(#REF!,【選択肢】!Q24)","v":{"$error":"#REF!"}},null,"②-2　活動計画書４（１）の加算措置の適用条件の確認ができるようにする"]
[8,null,null,null,null,null,null,4,null,null,null,null,null,null,null,{"$f":"'別紙1 活動計画書'!B111","v":0},20,"農地維持","推進活動","推進活動","20 集落外住民や地域住民との意見交換等",{"$f":"COUNTIF(#REF!,【選択肢】!Q25)","v":{"$error":"#REF!"}},null,"　　　「加算措置（みどり加算以外）」シートの「多面的機能の更なる増進に向けた活動への支援」の適用条件の確認欄についても同様に"]
[9,null,null,null,null,null,null,4.5,null,null,null,null,null,null,null,{"$f":"'別紙1 活動計画書'!M108","v":0},21,"農地維持","推進活動","推進活動","21 地域住民等に対する意向調査等",{"$f":"COUNTIF(#REF!,【選択肢】!Q26)","v":{"$error":"#REF!"}},null,"　　　「59　都道府県、市町村が特に認める活動」の下に行を挿入し、取組名を入力する。"]
[10,null,null,null,null,null,null,5,null,null,null,null,null,null,null,{"$f":"'別紙1 活動計画書'!M109","v":0},22,"農地維持","推進活動","推進活動","22 有識者等による研修会、検討会の開催",{"$f":"COUNTIF(#REF!,【選択肢】!Q27)","v":{"$error":"#REF!"}},null,"　　　「本事業計画の活動」の欄については、「59　都道府県、市町村が特に認める活動」の欄にある数式をコピーする。"]
[11,null,null,null,null,null,null,5.5,null,null,null,null,null,null,null,{"$f":"'別紙1 活動計画書'!M110","v":0},23,"農地維持","推進活動","推進活動","23 その他",{"$f":"COUNTIF(#REF!,【選択肢】!Q28)","v":{"$error":"#REF!"}}]
[12,null,null,null,null,null,null,6,null,null,null,null,null,null,null,{"$f":"'別紙1 活動計画書'!O117","v":0},24,"共同","機能診断・計画策定","機能診断","24 農用地の機能診断",{"$f":"COUNTIF(#REF!,【選択肢】!Q29)","v":{"$error":"#REF!"}},null,"③長寿命化の項目を追加する場合"]
[null,null,null,null,null,null,null,6.5,null,null,null,null,null,null,null,{"$f":"'別紙1 活動計画書'!O118","v":0},25,"共同","機能診断・計画策定","機能診断","25 水路の機能診断",{"$f":"COUNTIF(#REF!,【選択肢】!Q30)","v":{"$error":"#REF!"}},null,"活動計画書３（３）で実践活動を選択する際に、追加した項目を選択できるようにする"]
[null,null,null,null,null,null,null,7,null,null,null,null,null,null,null,{"$f":"'別紙1 活動計画書'!O119","v":0},26,"共同","機能診断・計画策定","機能診断","26 農道の機能診断",{"$f":"COUNTIF(#REF!,【選択肢】!Q31)","v":{"$error":"#REF!"}},null,"　１）対象施設を追加する場合は、「選択肢」シートのF6セルに追加する対象施設名を入力する。"]
[null,null,null,null,null,null,null,7.5,null,null,null,null,null,null,null,{"$f":"'別紙1 活動計画書'!O120","v":0},27,"共同","機能診断・計画策定","機能診断","27 ため池の機能診断",{"$f":"COUNTIF(#REF!,【選択肢】!Q32)","v":{"$error":"#REF!"}},null,"　　　次に、水路を対象とした取組であればH3セルより右のセルに、農道を対象とした取組であればH4セルより右のセルに、といった要領で番号と取組名"]
[null,null,null,null,null,null,null,8,null,null,null,null,null,null,null,{"$f":"'別紙1 活動計画書'!O121","v":0},28,"共同","機能診断・計画策定","計画策定","28 年度活動計画の策定",{"$f":"COUNTIF(#REF!,【選択肢】!Q33)","v":{"$error":"#REF!"}},null,"　　　を入力する。このとき、「●共通」で入力した取組名と同じになるように注意してください。"]
[null,null,null,null,null,null,null,8.5,null,null,null,null,null,null,null,"○",29,"共同","研修","研修","29 機能診断・補修技術等に関する研修",{"$f":"COUNTIF(#REF!,【選択肢】!Q34)","v":{"$error":"#REF!"}},null,"　２）新たに対象施設を追加した場合は、その施設名を名称とし、参照範囲を「G6:J6」とした名前を定義する。"]
[null,null,null,null,null,null,null,9,null,null,null,null,null,null,null,"○",30,"共同","実践活動","農用地","30 農用地の軽微な補修等",{"$f":"COUNTIF(#REF!,【選択肢】!Q35)","v":{"$error":"#REF!"}}]
[null,null,null,null,null,null,null,9.5,null,null,null,null,null,null,null,"○",31,"共同","実践活動","水路","31 水路の軽微な補修等",{"$f":"COUNTIF(#REF!,【選択肢】!Q36)","v":{"$error":"#REF!"}}]
[null,null,null,null,null,null,null,10,null,null,null,null,null,null,null,"○",32,"共同","実践活動","農道","32 農道の軽微な補修等",{"$f":"COUNTIF(#REF!,【選択肢】!Q37)","v":{"$error":"#REF!"}}]
[null,null,null,null,null,null,null,10.5,null,null,null,null,null,null,null,"○",33,"共同","実践活動","ため池","33 ため池の軽微な補修等",{"$f":"COUNTIF(#REF!,【選択肢】!Q38)","v":{"$error":"#REF!"}}]
[null,null,null,null,null,null,null,11,null,null,null,null,null,null,null,{"$f":"'別紙1 活動計画書'!O129","v":0},34,"共同","計画策定","生態系保全","34 生物多様性保全計画の策定",{"$f":"COUNTIF(#REF!,【選択肢】!Q39)","v":{"$error":"#REF!"}}]
[null,null,null,null,null,null,null,11.5,null,null,null,null,null,null,null,{"$f":"'別紙1 活動計画書'!O130","v":0},35,"共同","計画策定","水質保全","35 水質保全計画、農地保全計画の策定",{"$f":"COUNTIF(#REF!,【選択肢】!Q40)","v":{"$error":"#REF!"}}]
[null,null,null,null,null,null,null,12,null,null,null,null,null,null,null,{"$f":"'別紙1 活動計画書'!O131","v":0},36,"共同","計画策定","景観形成・生活環境保全","36 景観形成計画、生活環境保全計画の策定",{"$f":"COUNTIF(#REF!,【選択肢】!Q41)","v":{"$error":"#REF!"}}]
[null,null,null,null,null,null,null,null,null,null,null,null,null,null,null,{"$f":"'別紙1 活動計画書'!O132","v":0},37,"共同","計画策定","水田貯留・地下水かん養","37 水田貯留計画、地下水かん養計画の策定",{"$f":"COUNTIF(#REF!,【選択肢】!Q42)","v":{"$error":"#REF!"}},"活動計画書、実施状況報告書のプルダウン選択用"]
[null,null,null,null,null,null,null,null,null,null,null,null,null,null,null,{"$f":"'別紙1 活動計画書'!O133","v":0},38,"共同","計画策定","資源循環","38 資源循環計画の策定",{"$f":"COUNTIF(#REF!,【選択肢】!Q43)","v":{"$error":"#REF!"}},"Ｋ.農村環境保全活動"]
[null,null,null,null,null,null,null,null,null,null,null,null,null,null,null,{"$f":"IF(COUNTIF('別紙1 活動計画書'!$E$134:$J$138,【選択肢】!W44),\"○\",\"\")","v":""},39,"共同","実践活動","生態系保全","39 生物の生息状況の把握（生態系保全）",{"$f":"COUNTIF(#REF!,【選択肢】!Q44)","v":{"$error":"#REF!"}},"39 生物の生息状況の把握（生態系保全）"]
[null,null,null,null,null,null,null,null,null,null,null,null,null,null,null,{"$f":"IF(COUNTIF('別紙1 活動計画書'!$E$134:$J$138,【選択肢】!W45),\"○\",\"\")","v":""},40,"共同","実践活動","生態系保全","40 外来種の駆除（生態系保全）",{"$f":"COUNTIF(#REF!,【選択肢】!Q45)","v":{"$error":"#REF!"}},"40 外来種の駆除（生態系保全）"]
[null,null,null,null,null,null,null,null,null,null,null,null,null,null,null,{"$f":"IF(COUNTIF('別紙1 活動計画書'!$E$134:$J$138,【選択肢】!W46),\"○\",\"\")","v":""},41,"共同","実践活動","生態系保全","41 その他（生態系保全）",{"$f":"COUNTIF(#REF!,【選択肢】!Q46)","v":{"$error":"#REF!"}},"41 その他（生態系保全）"]
[null,null,null,null,null,null,null,null,null,null,null,null,null,null,null,{"$f":"IF(COUNTIF('別紙1 活動計画書'!$E$134:$J$138,【選択肢】!W47),\"○\",\"\")","v":""},42,"共同","実践活動","水質保全","42 水質モニタリングの実施・記録管理（水質保全）",{"$f":"COUNTIF(#REF!,【選択肢】!Q47)","v":{"$error":"#REF!"}},"42 水質モニタリングの実施・記録管理（水質保全）"]
[null,null,null,null,null,null,null,null,null,null,null,null,null,null,null,{"$f":"IF(COUNTIF('別紙1 活動計画書'!$E$134:$J$138,【選択肢】!W48),\"○\",\"\")","v":""},43,"共同","実践活動","水質保全","43 畑からの土砂流出対策（水質保全）",{"$f":"COUNTIF(#REF!,【選択肢】!Q48)","v":{"$error":"#REF!"}},"43 畑からの土砂流出対策（水質保全）"]
[null,null,null,null,null,null,null,null,null,null,null,null,null,null,null,{"$f":"IF(COUNTIF('別紙1 活動計画書'!$E$134:$J$138,【選択肢】!W49),\"○\",\"\")","v":""},44,"共同","実践活動","水質保全","44 その他（水質保全）",{"$f":"COUNTIF(#REF!,【選択肢】!Q49)","v":{"$error":"#REF!"}},"44 その他（水質保全）"]
[null,null,null,null,null,null,null,null,null,null,null,null,null,null,null,{"$f":"IF(COUNTIF('別紙1 活動計画書'!$E$134:$J$138,【選択肢】!W50),\"○\",\"\")","v":""},45,"共同","実践活動","景観形成・生活環境保全","45 植栽等の景観形成活動（景観形成・生活環境保全）",{"$f":"COUNTIF(#REF!,【選択肢】!Q50)","v":{"$error":"#REF!"}},"45 植栽等の景観形成活動（景観形成・生活環境保全）"]
[null,null,null,null,null,null,null,null,null,null,null,null,null,null,null,{"$f":"IF(COUNTIF('別紙1 活動計画書'!$E$134:$J$138,【選択肢】!W51),\"○\",\"\")","v":""},46,"共同","実践活動","景観形成・生活環境保全","46 施設等の定期的な巡回点検・清掃（景観形成・生活環境保全）",{"$f":"COUNTIF(#REF!,【選択肢】!Q51)","v":{"$error":"#REF!"}},"46 施設等の定期的な巡回点検・清掃（景観形成・生活環境保全）"]
[null,null,null,null,null,null,null,null,null,null,null,null,null,null,null,{"$f":"IF(COUNTIF('別紙1 活動計画書'!$E$134:$J$138,【選択肢】!W52),\"○\",\"\")","v":""},47,"共同","実践活動","景観形成・生活環境保全","47 その他（景観形成・生活環境保全）",{"$f":"COUNTIF(#REF!,【選択肢】!Q52)","v":{"$error":"#REF!"}},"47 その他（景観形成・生活環境保全）"]
[null,null,null,null,null,null,null,null,null,null,null,null,null,null,null,{"$f":"IF(COUNTIF('別紙1 活動計画書'!$E$134:$J$138,【選択肢】!W53),\"○\",\"\")","v":""},48,"共同","実践活動","水田貯留・地下水かん養","48 水田の貯留機能向上活動（水田貯留機能増進・地下水かん養）",{"$f":"COUNTIF(#REF!,【選択肢】!Q53)","v":{"$error":"#REF!"}},"48 水田の貯留機能向上活動（水田貯留機能増進・地下水かん養）"]
[null,null,null,null,null,null,null,null,null,null,null,null,null,null,null,{"$f":"IF(COUNTIF('別紙1 活動計画書'!$E$134:$J$138,【選択肢】!W54),\"○\",\"\")","v":""},49,"共同","実践活動","水田貯留・地下水かん養","49 地下水かん養活動、水源かん養林の保全（水田貯留機能増進・地下水かん養）",{"$f":"COUNTIF(#REF!,【選択肢】!Q54)","v":{"$error":"#REF!"}},"49 地下水かん養活動、水源かん養林の保全（水田貯留機能増進・地下水かん養）"]
[null,null,null,null,null,null,null,null,null,null,null,null,null,null,null,{"$f":"IF(COUNTIF('別紙1 活動計画書'!$E$134:$J$138,【選択肢】!W55),\"○\",\"\")","v":""},50,"共同","実践活動","資源循環","50 地域資源の活用・資源循環活動（資源循環）",{"$f":"COUNTIF(#REF!,【選択肢】!Q55)","v":{"$error":"#REF!"}},"50 地域資源の活用・資源循環活動（資源循環）"]
[null,null,null,null,null,null,null,null,null,null,null,null,null,null,null,{"$f":"'別紙1 活動計画書'!O140","v":0},51,"共同","啓発・普及","啓発・普及","51 啓発・普及活動",{"$f":"COUNTIF(#REF!,【選択肢】!Q56)","v":{"$error":"#REF!"}},"106 水質の保全を図る施設の適正管理"]
[null,null,null,null,null,null,null,null,null,null,null,null,null,null,null,{"$f":"'別紙1 活動計画書'!O144","v":0},52,"共同","増進活動","増進活動","52 遊休農地の有効活用",{"$f":"COUNTIF(#REF!,【選択肢】!Q57)","v":{"$error":"#REF!"}}]
[null,null,null,null,null,null,null,null,null,null,null,null,null,null,null,{"$f":"'別紙1 活動計画書'!O145","v":0},53,"共同","増進活動","増進活動","53 鳥獣被害防止対策及び環境改善活動の強化",{"$f":"COUNTIF(#REF!,【選択肢】!Q58)","v":{"$error":"#REF!"}}]
[null,null,null,null,null,null,null,null,null,null,null,null,null,null,null,{"$f":"'別紙1 活動計画書'!O146","v":0},54,"共同","増進活動","増進活動","54 地域住民による直営施工",{"$f":"COUNTIF(#REF!,【選択肢】!Q59)","v":{"$error":"#REF!"}}]
[null,null,null,null,null,null,null,null,null,null,null,null,null,null,null,{"$f":"'別紙1 活動計画書'!O147","v":0},55,"共同","増進活動","増進活動","55 防災・減災力の強化",{"$f":"COUNTIF(#REF!,【選択肢】!Q60)","v":{"$error":"#REF!"}}]
[null,null,null,null,null,null,null,null,null,null,null,null,null,null,null,{"$f":"'別紙1 活動計画書'!O148","v":0},56,"共同","増進活動","増進活動","56 農村環境保全活動の幅広い展開",{"$f":"COUNTIF(#REF!,【選択肢】!Q61)","v":{"$error":"#REF!"}}]
[null,null,null,null,null,null,null,null,null,null,null,null,null,null,null,{"$f":"'別紙1 活動計画書'!O149","v":0},57,"共同","増進活動","増進活動","57 やすらぎ・福祉及び教育機能の活用",{"$f":"COUNTIF(#REF!,【選択肢】!Q62)","v":{"$error":"#REF!"}}]
[null,null,null,null,null,null,null,null,null,null,null,null,null,null,null,{"$f":"'別紙1 活動計画書'!O150","v":0},58,"共同","増進活動","増進活動","58 農村文化の伝承を通じた農村コミュニティの強化",{"$f":"COUNTIF(#REF!,【選択肢】!Q63)","v":{"$error":"#REF!"}}]
[null,null,null,null,null,null,null,null,null,null,null,null,null,null,null,{"$f":"'別紙1 活動計画書'!O151","v":0},"58-2","共同","増進活動","増進活動","58-2 広域活動組織における活動支援班による活動の実施",{"$f":"COUNTIF(#REF!,【選択肢】!Q64)","v":{"$error":"#REF!"}}]
[null,null,null,null,null,null,null,null,null,null,null,null,null,null,null,{"$f":"'別紙1 活動計画書'!O152","v":0},"58-3","共同","増進活動","増進活動","58-3 水管理を通じた環境負荷低減活動の強化",{"$f":"COUNTIF(#REF!,【選択肢】!Q65)","v":{"$error":"#REF!"}}]
[null,null,null,null,null,null,null,null,null,null,null,null,null,null,null,{"$f":"'別紙1 活動計画書'!O153","v":0},59,"共同","増進活動","増進活動","59 都道府県、市町村が特に認める活動",{"$f":"COUNTIF(#REF!,【選択肢】!Q66)","v":{"$error":"#REF!"}}]
[null,null,null,null,null,null,null,null,null,null,null,null,null,null,null,{"$f":"'別紙1 活動計画書'!O155","v":0},60,"共同","増進活動","増進活動","60 広報活動・農村関係人口の拡大",{"$f":"COUNTIF(#REF!,【選択肢】!Q67)","v":{"$error":"#REF!"}}]
[null,null,null,null,null,null,null,null,null,null,null,null,null,null,null,{"$f":"IF(COUNTIF('別紙1 活動計画書'!$D$179:$D$189,G3),\"○\",\"\")","v":""},61,"長寿命化","実践活動","水路","61 水路の補修",{"$f":"COUNTIF(#REF!,【選択肢】!Q68)","v":{"$error":"#REF!"}}]
[null,null,null,null,null,null,null,null,null,null,null,null,null,null,null,{"$f":"IF(COUNTIF('別紙1 活動計画書'!$D$179:$D$189,H3),\"○\",\"\")","v":""},62,"長寿命化","実践活動","水路","62 水路の更新等",{"$f":"COUNTIF(#REF!,【選択肢】!Q69)","v":{"$error":"#REF!"}}]
[null,null,null,null,null,null,null,null,null,null,null,null,null,null,null,{"$f":"IF(COUNTIF('別紙1 活動計画書'!$D$179:$D$189,G4),\"○\",\"\")","v":""},63,"長寿命化","実践活動","農道","63 農道の補修",{"$f":"COUNTIF(#REF!,【選択肢】!Q70)","v":{"$error":"#REF!"}}]
[null,null,null,null,null,null,null,null,null,null,null,null,null,null,null,{"$f":"IF(COUNTIF('別紙1 活動計画書'!$D$179:$D$189,H4),\"○\",\"\")","v":"○"},64,"長寿命化","実践活動","農道","64 農道の更新等",{"$f":"COUNTIF(#REF!,【選択肢】!Q71)","v":{"$error":"#REF!"}}]
[null,null,null,null,null,null,null,null,null,null,null,null,null,null,null,{"$f":"IF(COUNTIF('別紙1 活動計画書'!$D$179:$D$189,G5),\"○\",\"\")","v":"○"},65,"長寿命化","実践活動","ため池","65 ため池の補修",{"$f":"COUNTIF(#REF!,【選択肢】!Q72)","v":{"$error":"#REF!"}}]
[null,null,null,null,null,null,null,null,null,null,null,null,null,null,null,{"$f":"IF(COUNTIF('別紙1 活動計画書'!$D$179:$D$189,H5),\"○\",\"\")","v":""},66,"長寿命化","実践活動","ため池","66 ため池（附帯施設）の更新等",{"$f":"COUNTIF(#REF!,【選択肢】!Q73)","v":{"$error":"#REF!"}}]
[null,null,null,null,null,null,null,null,null,null,null,null,null,null,null,"○",100,"農地維持","実践活動","農用地","100 農用地進入路の適正管理",0]
[null,null,null,null,null,null,null,null,null,null,null,null,null,null,null,"○",101,"農地維持","実践活動","水路","101 配水操作",0]
[null,null,null,null,null,null,null,null,null,null,null,null,null,null,null,"○",102,"農地維持","実践活動","ため池","102 配水操作",0]
[null,null,null,null,null,null,null,null,null,null,null,null,null,null,null,"○",103,"農地維持","実践活動","ため池","103 鳥獣害防護柵の適正管理",0]
[null,null,null,null,null,null,null,null,null,null,null,null,null,null,null,"○",104,"共同","実践活動","農用地","104 農用地進入路の補修",0]
[null,null,null,null,null,null,null,null,null,null,null,null,null,null,null,"○",105,"共同","実践活動","ため池","105 鳥獣害防護柵の補修・設置",0]
[null,null,null,null,null,null,null,null,null,null,null,null,null,null,null,"○",106,"共同","実践活動","水質保全","106 水質の保全を図る施設の適正管理",0]
[null,null,null,null,null,null,null,null,null,null,null,null,null,null,null,"○",107,"長寿命化","実践活動","水路","107 水路法面の補修",0]
[null,null,null,null,null,null,null,null,null,null,null,null,null,null,null,"○",108,"長寿命化","実践活動","水路","108 取水施設の補修",0]
[null,null,null,null,null,null,null,null,null,null,null,null,null,null,null,"○",109,"長寿命化","実践活動","農地に係る施設","109 農地に係る施設の補修",0]
[null,null,null,null,null,null,null,null,null,null,null,null,null,null,null,"○",110,"長寿命化","実践活動","農地に係る施設","110 農地に係る施設の更新等",0]
[null,null,null,null,null,null,null,null,null,null,null,null,null,null,null,"○",111,"長寿命化","実践活動","農地に係る施設","111 農用地進入路の更新等",0]
[null,null,null,null,null,null,null,null,null,null,null,null,null,null,null,"○"]
[null,null,null,null,null,null,null,null,null,null,null,null,null,null,null,"○"]
[null,null,null,null,null,null,null,null,null,null,null,null,null,null,null,"○"]
[null,null,null,null,null,null,null,null,null,null,null,null,null,null,null,"○"]
[null,null,null,null,null,null,null,null,null,null,null,null,null,null,null,null,null,null,"この線より上に行を挿入してください。"]
[]
[]
[]
[]
[]
[]
[]
[]
[]
[]
[]
[]
[]
[null,null,null,null,null,null,null,null,null,null,null,null,null,null,null,null,"P列に○がついている項目のみを抽出"]
[null,null,null,null,null,null,null,null,null,null,null,null,null,null,null,null,{"$f":"IFERROR(INDEX($Q$3:$U$89, SMALL(IF($P$3:$P$89=\"○\", ROW($P$3:$P$89)-ROW($P$3)+1), ROW(A1)), COLUMNS($Q$3:Q3)), \"\")","v":200},{"$f":"IFERROR(INDEX($Q$3:$U$89, SMALL(IF($P$3:$P$89=\"○\", ROW($P$3:$P$89)-ROW($P$3)+1), ROW(B1)), COLUMNS($Q$3:R3)), \"\")","v":"-"},{"$f":"IFERROR(INDEX($Q$3:$U$89, SMALL(IF($P$3:$P$89=\"○\", ROW($P$3:$P$89)-ROW($P$3)+1), ROW(C1)), COLUMNS($Q$3:S3)), \"\")","v":"事務処理"},{"$f":"IFERROR(INDEX($Q$3:$U$89, SMALL(IF($P$3:$P$89=\"○\", ROW($P$3:$P$89)-ROW($P$3)+1), ROW(D1)), COLUMNS($Q$3:T3)), \"\")","v":"事務処理"},{"$f":"IFERROR(INDEX($Q$3:$U$89, SMALL(IF($P$3:$P$89=\"○\", ROW($P$3:$P$89)-ROW($P$3)+1), ROW(E1)), COLUMNS($Q$3:U3)), \"\")","v":"200 事務処理"}]
[null,null,null,null,null,null,null,null,null,null,null,null,null,null,null,null,{"$f":"IFERROR(INDEX($Q$3:$U$89, SMALL(IF($P$3:$P$89=\"○\", ROW($P$3:$P$89)-ROW($P$3)+1), ROW(A2)), COLUMNS($Q$3:Q4)), \"\")","v":300},{"$f":"IFERROR(INDEX($Q$3:$U$89, SMALL(IF($P$3:$P$89=\"○\", ROW($P$3:$P$89)-ROW($P$3)+1), ROW(B2)), COLUMNS($Q$3:R4)), \"\")","v":"-"},{"$f":"IFERROR(INDEX($Q$3:$U$89, SMALL(IF($P$3:$P$89=\"○\", ROW($P$3:$P$89)-ROW($P$3)+1), ROW(C2)), COLUMNS($Q$3:S4)), \"\")","v":"会議"},{"$f":"IFERROR(INDEX($Q$3:$U$89, SMALL(IF($P$3:$P$89=\"○\", ROW($P$3:$P$89)-ROW($P$3)+1), ROW(D2)), COLUMNS($Q$3:T4)), \"\")","v":"会議"},{"$f":"IFERROR(INDEX($Q$3:$U$89, SMALL(IF($P$3:$P$89=\"○\", ROW($P$3:$P$89)-ROW($P$3)+1), ROW(E2)), COLUMNS($Q$3:U4)), \"\")","v":"300 会議"}]
[null,null,null,null,null,null,null,null,null,null,null,null,null,null,null,null,{"$f":"IFERROR(INDEX($Q$3:$U$89, SMALL(IF($P$3:$P$89=\"○\", ROW($P$3:$P$89)-ROW($P$3)+1), ROW(A3)), COLUMNS($Q$3:Q5)), \"\")","v":3},{"$f":"IFERROR(INDEX($Q$3:$U$89, SMALL(IF($P$3:$P$89=\"○\", ROW($P$3:$P$89)-ROW($P$3)+1), ROW(B3)), COLUMNS($Q$3:R5)), \"\")","v":"農地維持"},{"$f":"IFERROR(INDEX($Q$3:$U$89, SMALL(IF($P$3:$P$89=\"○\", ROW($P$3:$P$89)-ROW($P$3)+1), ROW(C3)), COLUMNS($Q$3:S5)), \"\")","v":"研修"},{"$f":"IFERROR(INDEX($Q$3:$U$89, SMALL(IF($P$3:$P$89=\"○\", ROW($P$3:$P$89)-ROW($P$3)+1), ROW(D3)), COLUMNS($Q$3:T5)), \"\")","v":"研修"},{"$f":"IFERROR(INDEX($Q$3:$U$89, SMALL(IF($P$3:$P$89=\"○\", ROW($P$3:$P$89)-ROW($P$3)+1), ROW(E3)), COLUMNS($Q$3:U5)), \"\")","v":"3 事務・組織運営等に関する研修、機械の安全使用に関する研修"}]
[null,null,null,null,null,null,null,null,null,null,null,null,null,null,null,null,{"$f":"IFERROR(INDEX($Q$3:$U$89, SMALL(IF($P$3:$P$89=\"○\", ROW($P$3:$P$89)-ROW($P$3)+1), ROW(A4)), COLUMNS($Q$3:Q6)), \"\")","v":6},{"$f":"IFERROR(INDEX($Q$3:$U$89, SMALL(IF($P$3:$P$89=\"○\", ROW($P$3:$P$89)-ROW($P$3)+1), ROW(B4)), COLUMNS($Q$3:R6)), \"\")","v":"農地維持"},{"$f":"IFERROR(INDEX($Q$3:$U$89, SMALL(IF($P$3:$P$89=\"○\", ROW($P$3:$P$89)-ROW($P$3)+1), ROW(C4)), COLUMNS($Q$3:S6)), \"\")","v":"実践活動"},{"$f":"IFERROR(INDEX($Q$3:$U$89, SMALL(IF($P$3:$P$89=\"○\", ROW($P$3:$P$89)-ROW($P$3)+1), ROW(D4)), COLUMNS($Q$3:T6)), \"\")","v":"農用地"},{"$f":"IFERROR(INDEX($Q$3:$U$89, SMALL(IF($P$3:$P$89=\"○\", ROW($P$3:$P$89)-ROW($P$3)+1), ROW(E4)), COLUMNS($Q$3:U6)), \"\")","v":"6 鳥獣害防護柵等の保守管理"}]
[null,null,null,null,null,null,null,null,null,null,null,null,null,null,null,null,{"$f":"IFERROR(INDEX($Q$3:$U$89, SMALL(IF($P$3:$P$89=\"○\", ROW($P$3:$P$89)-ROW($P$3)+1), ROW(A5)), COLUMNS($Q$3:Q7)), \"\")","v":9},{"$f":"IFERROR(INDEX($Q$3:$U$89, SMALL(IF($P$3:$P$89=\"○\", ROW($P$3:$P$89)-ROW($P$3)+1), ROW(B5)), COLUMNS($Q$3:R7)), \"\")","v":"農地維持"},{"$f":"IFERROR(INDEX($Q$3:$U$89, SMALL(IF($P$3:$P$89=\"○\", ROW($P$3:$P$89)-ROW($P$3)+1), ROW(C5)), COLUMNS($Q$3:S7)), \"\")","v":"実践活動"},{"$f":"IFERROR(INDEX($Q$3:$U$89, SMALL(IF($P$3:$P$89=\"○\", ROW($P$3:$P$89)-ROW($P$3)+1), ROW(D5)), COLUMNS($Q$3:T7)), \"\")","v":"水路"},{"$f":"IFERROR(INDEX($Q$3:$U$89, SMALL(IF($P$3:$P$89=\"○\", ROW($P$3:$P$89)-ROW($P$3)+1), ROW(E5)), COLUMNS($Q$3:U7)), \"\")","v":"9 水路附帯施設の保守管理"}]
[null,null,null,null,null,null,null,null,null,null,null,null,null,null,null,null,{"$f":"IFERROR(INDEX($Q$3:$U$89, SMALL(IF($P$3:$P$89=\"○\", ROW($P$3:$P$89)-ROW($P$3)+1), ROW(A6)), COLUMNS($Q$3:Q8)), \"\")","v":11},{"$f":"IFERROR(INDEX($Q$3:$U$89, SMALL(IF($P$3:$P$89=\"○\", ROW($P$3:$P$89)-ROW($P$3)+1), ROW(B6)), COLUMNS($Q$3:R8)), \"\")","v":"農地維持"},{"$f":"IFERROR(INDEX($Q$3:$U$89, SMALL(IF($P$3:$P$89=\"○\", ROW($P$3:$P$89)-ROW($P$3)+1), ROW(C6)), COLUMNS($Q$3:S8)), \"\")","v":"実践活動"},{"$f":"IFERROR(INDEX($Q$3:$U$89, SMALL(IF($P$3:$P$89=\"○\", ROW($P$3:$P$89)-ROW($P$3)+1), ROW(D6)), COLUMNS($Q$3:T8)), \"\")","v":"農道"},{"$f":"IFERROR(INDEX($Q$3:$U$89, SMALL(IF($P$3:$P$89=\"○\", ROW($P$3:$P$89)-ROW($P$3)+1), ROW(E6)), COLUMNS($Q$3:U8)), \"\")","v":"11 農道側溝の泥上げ"}]
[null,null,null,null,null,null,null,null,null,null,null,null,null,null,null,null,{"$f":"IFERROR(INDEX($Q$3:$U$89, SMALL(IF($P$3:$P$89=\"○\", ROW($P$3:$P$89)-ROW($P$3)+1), ROW(A7)), COLUMNS($Q$3:Q9)), \"\")","v":12},{"$f":"IFERROR(INDEX($Q$3:$U$89, SMALL(IF($P$3:$P$89=\"○\", ROW($P$3:$P$89)-ROW($P$3)+1), ROW(B7)), COLUMNS($Q$3:R9)), \"\")","v":"農地維持"},{"$f":"IFERROR(INDEX($Q$3:$U$89, SMALL(IF($P$3:$P$89=\"○\", ROW($P$3:$P$89)-ROW($P$3)+1), ROW(C7)), COLUMNS($Q$3:S9)), \"\")","v":"実践活動"},{"$f":"IFERROR(INDEX($Q$3:$U$89, SMALL(IF($P$3:$P$89=\"○\", ROW($P$3:$P$89)-ROW($P$3)+1), ROW(D7)), COLUMNS($Q$3:T9)), \"\")","v":"農道"},{"$f":"IFERROR(INDEX($Q$3:$U$89, SMALL(IF($P$3:$P$89=\"○\", ROW($P$3:$P$89)-ROW($P$3)+1), ROW(E7)), COLUMNS($Q$3:U9)), \"\")","v":"12 路面の維持"}]
[null,null,null,null,null,null,null,null,null,null,null,null,null,null,null,null,{"$f":"IFERROR(INDEX($Q$3:$U$89, SMALL(IF($P$3:$P$89=\"○\", ROW($P$3:$P$89)-ROW($P$3)+1), ROW(A8)), COLUMNS($Q$3:Q10)), \"\")","v":14},{"$f":"IFERROR(INDEX($Q$3:$U$89, SMALL(IF($P$3:$P$89=\"○\", ROW($P$3:$P$89)-ROW($P$3)+1), ROW(B8)), COLUMNS($Q$3:R10)), \"\")","v":"農地維持"},{"$f":"IFERROR(INDEX($Q$3:$U$89, SMALL(IF($P$3:$P$89=\"○\", ROW($P$3:$P$89)-ROW($P$3)+1), ROW(C8)), COLUMNS($Q$3:S10)), \"\")","v":"実践活動"},{"$f":"IFERROR(INDEX($Q$3:$U$89, SMALL(IF($P$3:$P$89=\"○\", ROW($P$3:$P$89)-ROW($P$3)+1), ROW(D8)), COLUMNS($Q$3:T10)), \"\")","v":"ため池"},{"$f":"IFERROR(INDEX($Q$3:$U$89, SMALL(IF($P$3:$P$89=\"○\", ROW($P$3:$P$89)-ROW($P$3)+1), ROW(E8)), COLUMNS($Q$3:U10)), \"\")","v":"14 ため池の泥上げ"}]
[null,null,null,null,null,null,null,null,null,null,null,null,null,null,null,null,{"$f":"IFERROR(INDEX($Q$3:$U$89, SMALL(IF($P$3:$P$89=\"○\", ROW($P$3:$P$89)-ROW($P$3)+1), ROW(A9)), COLUMNS($Q$3:Q11)), \"\")","v":15},{"$f":"IFERROR(INDEX($Q$3:$U$89, SMALL(IF($P$3:$P$89=\"○\", ROW($P$3:$P$89)-ROW($P$3)+1), ROW(B9)), COLUMNS($Q$3:R11)), \"\")","v":"農地維持"},{"$f":"IFERROR(INDEX($Q$3:$U$89, SMALL(IF($P$3:$P$89=\"○\", ROW($P$3:$P$89)-ROW($P$3)+1), ROW(C9)), COLUMNS($Q$3:S11)), \"\")","v":"実践活動"},{"$f":"IFERROR(INDEX($Q$3:$U$89, SMALL(IF($P$3:$P$89=\"○\", ROW($P$3:$P$89)-ROW($P$3)+1), ROW(D9)), COLUMNS($Q$3:T11)), \"\")","v":"ため池"},{"$f":"IFERROR(INDEX($Q$3:$U$89, SMALL(IF($P$3:$P$89=\"○\", ROW($P$3:$P$89)-ROW($P$3)+1), ROW(E9)), COLUMNS($Q$3:U11)), \"\")","v":"15 ため池附帯施設の保守管理"}]
[null,null,null,null,null,null,null,null,null,null,null,null,null,null,null,null,{"$f":"IFERROR(INDEX($Q$3:$U$89, SMALL(IF($P$3:$P$89=\"○\", ROW($P$3:$P$89)-ROW($P$3)+1), ROW(A10)), COLUMNS($Q$3:Q12)), \"\")","v":16},{"$f":"IFERROR(INDEX($Q$3:$U$89, SMALL(IF($P$3:$P$89=\"○\", ROW($P$3:$P$89)-ROW($P$3)+1), ROW(B10)), COLUMNS($Q$3:R12)), \"\")","v":"農地維持"},{"$f":"IFERROR(INDEX($Q$3:$U$89, SMALL(IF($P$3:$P$89=\"○\", ROW($P$3:$P$89)-ROW($P$3)+1), ROW(C10)), COLUMNS($Q$3:S12)), \"\")","v":"実践活動"},{"$f":"IFERROR(INDEX($Q$3:$U$89, SMALL(IF($P$3:$P$89=\"○\", ROW($P$3:$P$89)-ROW($P$3)+1), ROW(D10)), COLUMNS($Q$3:T12)), \"\")","v":"共通"},{"$f":"IFERROR(INDEX($Q$3:$U$89, SMALL(IF($P$3:$P$89=\"○\", ROW($P$3:$P$89)-ROW($P$3)+1), ROW(E10)), COLUMNS($Q$3:U12)), \"\")","v":"16 異常気象時の対応"}]
[null,null,null,null,null,null,null,null,null,null,null,null,null,null,null,null,{"$f":"IFERROR(INDEX($Q$3:$U$89, SMALL(IF($P$3:$P$89=\"○\", ROW($P$3:$P$89)-ROW($P$3)+1), ROW(A11)), COLUMNS($Q$3:Q13)), \"\")","v":29},{"$f":"IFERROR(INDEX($Q$3:$U$89, SMALL(IF($P$3:$P$89=\"○\", ROW($P$3:$P$89)-ROW($P$3)+1), ROW(B11)), COLUMNS($Q$3:R13)), \"\")","v":"共同"},{"$f":"IFERROR(INDEX($Q$3:$U$89, SMALL(IF($P$3:$P$89=\"○\", ROW($P$3:$P$89)-ROW($P$3)+1), ROW(C11)), COLUMNS($Q$3:S13)), \"\")","v":"研修"},{"$f":"IFERROR(INDEX($Q$3:$U$89, SMALL(IF($P$3:$P$89=\"○\", ROW($P$3:$P$89)-ROW($P$3)+1), ROW(D11)), COLUMNS($Q$3:T13)), \"\")","v":"研修"},{"$f":"IFERROR(INDEX($Q$3:$U$89, SMALL(IF($P$3:$P$89=\"○\", ROW($P$3:$P$89)-ROW($P$3)+1), ROW(E11)), COLUMNS($Q$3:U13)), \"\")","v":"29 機能診断・補修技術等に関する研修"}]
[null,null,null,null,null,null,null,null,null,null,null,null,null,null,null,null,{"$f":"IFERROR(INDEX($Q$3:$U$89, SMALL(IF($P$3:$P$89=\"○\", ROW($P$3:$P$89)-ROW($P$3)+1), ROW(A12)), COLUMNS($Q$3:Q14)), \"\")","v":30},{"$f":"IFERROR(INDEX($Q$3:$U$89, SMALL(IF($P$3:$P$89=\"○\", ROW($P$3:$P$89)-ROW($P$3)+1), ROW(B12)), COLUMNS($Q$3:R14)), \"\")","v":"共同"},{"$f":"IFERROR(INDEX($Q$3:$U$89, SMALL(IF($P$3:$P$89=\"○\", ROW($P$3:$P$89)-ROW($P$3)+1), ROW(C12)), COLUMNS($Q$3:S14)), \"\")","v":"実践活動"},{"$f":"IFERROR(INDEX($Q$3:$U$89, SMALL(IF($P$3:$P$89=\"○\", ROW($P$3:$P$89)-ROW($P$3)+1), ROW(D12)), COLUMNS($Q$3:T14)), \"\")","v":"農用地"},{"$f":"IFERROR(INDEX($Q$3:$U$89, SMALL(IF($P$3:$P$89=\"○\", ROW($P$3:$P$89)-ROW($P$3)+1), ROW(E12)), COLUMNS($Q$3:U14)), \"\")","v":"30 農用地の軽微な補修等"}]
[null,null,null,null,null,null,null,null,null,null,null,null,null,null,null,null,{"$f":"IFERROR(INDEX($Q$3:$U$89, SMALL(IF($P$3:$P$89=\"○\", ROW($P$3:$P$89)-ROW($P$3)+1), ROW(A13)), COLUMNS($Q$3:Q15)), \"\")","v":31},{"$f":"IFERROR(INDEX($Q$3:$U$89, SMALL(IF($P$3:$P$89=\"○\", ROW($P$3:$P$89)-ROW($P$3)+1), ROW(B13)), COLUMNS($Q$3:R15)), \"\")","v":"共同"},{"$f":"IFERROR(INDEX($Q$3:$U$89, SMALL(IF($P$3:$P$89=\"○\", ROW($P$3:$P$89)-ROW($P$3)+1), ROW(C13)), COLUMNS($Q$3:S15)), \"\")","v":"実践活動"},{"$f":"IFERROR(INDEX($Q$3:$U$89, SMALL(IF($P$3:$P$89=\"○\", ROW($P$3:$P$89)-ROW($P$3)+1), ROW(D13)), COLUMNS($Q$3:T15)), \"\")","v":"水路"},{"$f":"IFERROR(INDEX($Q$3:$U$89, SMALL(IF($P$3:$P$89=\"○\", ROW($P$3:$P$89)-ROW($P$3)+1), ROW(E13)), COLUMNS($Q$3:U15)), \"\")","v":"31 水路の軽微な補修等"}]
[null,null,null,null,null,null,null,null,null,null,null,null,null,null,null,null,{"$f":"IFERROR(INDEX($Q$3:$U$89, SMALL(IF($P$3:$P$89=\"○\", ROW($P$3:$P$89)-ROW($P$3)+1), ROW(A14)), COLUMNS($Q$3:Q16)), \"\")","v":32},{"$f":"IFERROR(INDEX($Q$3:$U$89, SMALL(IF($P$3:$P$89=\"○\", ROW($P$3:$P$89)-ROW($P$3)+1), ROW(B14)), COLUMNS($Q$3:R16)), \"\")","v":"共同"},{"$f":"IFERROR(INDEX($Q$3:$U$89, SMALL(IF($P$3:$P$89=\"○\", ROW($P$3:$P$89)-ROW($P$3)+1), ROW(C14)), COLUMNS($Q$3:S16)), \"\")","v":"実践活動"},{"$f":"IFERROR(INDEX($Q$3:$U$89, SMALL(IF($P$3:$P$89=\"○\", ROW($P$3:$P$89)-ROW($P$3)+1), ROW(D14)), COLUMNS($Q$3:T16)), \"\")","v":"農道"},{"$f":"IFERROR(INDEX($Q$3:$U$89, SMALL(IF($P$3:$P$89=\"○\", ROW($P$3:$P$89)-ROW($P$3)+1), ROW(E14)), COLUMNS($Q$3:U16)), \"\")","v":"32 農道の軽微な補修等"}]
[null,null,null,null,null,null,null,null,null,null,null,null,null,null,null,null,{"$f":"IFERROR(INDEX($Q$3:$U$89, SMALL(IF($P$3:$P$89=\"○\", ROW($P$3:$P$89)-ROW($P$3)+1), ROW(A15)), COLUMNS($Q$3:Q17)), \"\")","v":33},{"$f":"IFERROR(INDEX($Q$3:$U$89, SMALL(IF($P$3:$P$89=\"○\", ROW($P$3:$P$89)-ROW($P$3)+1), ROW(B15)), COLUMNS($Q$3:R17)), \"\")","v":"共同"},{"$f":"IFERROR(INDEX($Q$3:$U$89, SMALL(IF($P$3:$P$89=\"○\", ROW($P$3:$P$89)-ROW($P$3)+1), ROW(C15)), COLUMNS($Q$3:S17)), \"\")","v":"実践活動"},{"$f":"IFERROR(INDEX($Q$3:$U$89, SMALL(IF($P$3:$P$89=\"○\", ROW($P$3:$P$89)-ROW($P$3)+1), ROW(D15)), COLUMNS($Q$3:T17)), \"\")","v":"ため池"},{"$f":"IFERROR(INDEX($Q$3:$U$89, SMALL(IF($P$3:$P$89=\"○\", ROW($P$3:$P$89)-ROW($P$3)+1), ROW(E15)), COLUMNS($Q$3:U17)), \"\")","v":"33 ため池の軽微な補修等"}]
[null,null,null,null,null,null,null,null,null,null,null,null,null,null,null,null,{"$f":"IFERROR(INDEX($Q$3:$U$89, SMALL(IF($P$3:$P$89=\"○\", ROW($P$3:$P$89)-ROW($P$3)+1), ROW(A16)), COLUMNS($Q$3:Q18)), \"\")","v":64},{"$f":"IFERROR(INDEX($Q$3:$U$89, SMALL(IF($P$3:$P$89=\"○\", ROW($P$3:$P$89)-ROW($P$3)+1), ROW(B16)), COLUMNS($Q$3:R18)), \"\")","v":"長寿命化"},{"$f":"IFERROR(INDEX($Q$3:$U$89, SMALL(IF($P$3:$P$89=\"○\", ROW($P$3:$P$89)-ROW($P$3)+1), ROW(C16)), COLUMNS($Q$3:S18)), \"\")","v":"実践活動"},{"$f":"IFERROR(INDEX($Q$3:$U$89, SMALL(IF($P$3:$P$89=\"○\", ROW($P$3:$P$89)-ROW($P$3)+1), ROW(D16)), COLUMNS($Q$3:T18)), \"\")","v":"農道"},{"$f":"IFERROR(INDEX($Q$3:$U$89, SMALL(IF($P$3:$P$89=\"○\", ROW($P$3:$P$89)-ROW($P$3)+1), ROW(E16)), COLUMNS($Q$3:U18)), \"\")","v":"64 農道の更新等"}]
[null,null,null,null,null,null,null,null,null,null,null,null,null,null,null,null,{"$f":"IFERROR(INDEX($Q$3:$U$89, SMALL(IF($P$3:$P$89=\"○\", ROW($P$3:$P$89)-ROW($P$3)+1), ROW(A17)), COLUMNS($Q$3:Q19)), \"\")","v":65},{"$f":"IFERROR(INDEX($Q$3:$U$89, SMALL(IF($P$3:$P$89=\"○\", ROW($P$3:$P$89)-ROW($P$3)+1), ROW(B17)), COLUMNS($Q$3:R19)), \"\")","v":"長寿命化"},{"$f":"IFERROR(INDEX($Q$3:$U$89, SMALL(IF($P$3:$P$89=\"○\", ROW($P$3:$P$89)-ROW($P$3)+1), ROW(C17)), COLUMNS($Q$3:S19)), \"\")","v":"実践活動"},{"$f":"IFERROR(INDEX($Q$3:$U$89, SMALL(IF($P$3:$P$89=\"○\", ROW($P$3:$P$89)-ROW($P$3)+1), ROW(D17)), COLUMNS($Q$3:T19)), \"\")","v":"ため池"},{"$f":"IFERROR(INDEX($Q$3:$U$89, SMALL(IF($P$3:$P$89=\"○\", ROW($P$3:$P$89)-ROW($P$3)+1), ROW(E17)), COLUMNS($Q$3:U19)), \"\")","v":"65 ため池の補修"}]
[null,null,null,null,null,null,null,null,null,null,null,null,null,null,null,null,{"$f":"IFERROR(INDEX($Q$3:$U$89, SMALL(IF($P$3:$P$89=\"○\", ROW($P$3:$P$89)-ROW($P$3)+1), ROW(A18)), COLUMNS($Q$3:Q20)), \"\")","v":100},{"$f":"IFERROR(INDEX($Q$3:$U$89, SMALL(IF($P$3:$P$89=\"○\", ROW($P$3:$P$89)-ROW($P$3)+1), ROW(B18)), COLUMNS($Q$3:R20)), \"\")","v":"農地維持"},{"$f":"IFERROR(INDEX($Q$3:$U$89, SMALL(IF($P$3:$P$89=\"○\", ROW($P$3:$P$89)-ROW($P$3)+1), ROW(C18)), COLUMNS($Q$3:S20)), \"\")","v":"実践活動"},{"$f":"IFERROR(INDEX($Q$3:$U$89, SMALL(IF($P$3:$P$89=\"○\", ROW($P$3:$P$89)-ROW($P$3)+1), ROW(D18)), COLUMNS($Q$3:T20)), \"\")","v":"農用地"},{"$f":"IFERROR(INDEX($Q$3:$U$89, SMALL(IF($P$3:$P$89=\"○\", ROW($P$3:$P$89)-ROW($P$3)+1), ROW(E18)), COLUMNS($Q$3:U20)), \"\")","v":"100 農用地進入路の適正管理"}]
[null,null,null,null,null,null,null,null,null,null,null,null,null,null,null,null,{"$f":"IFERROR(INDEX($Q$3:$U$89, SMALL(IF($P$3:$P$89=\"○\", ROW($P$3:$P$89)-ROW($P$3)+1), ROW(A19)), COLUMNS($Q$3:Q21)), \"\")","v":101},{"$f":"IFERROR(INDEX($Q$3:$U$89, SMALL(IF($P$3:$P$89=\"○\", ROW($P$3:$P$89)-ROW($P$3)+1), ROW(B19)), COLUMNS($Q$3:R21)), \"\")","v":"農地維持"},{"$f":"IFERROR(INDEX($Q$3:$U$89, SMALL(IF($P$3:$P$89=\"○\", ROW($P$3:$P$89)-ROW($P$3)+1), ROW(C19)), COLUMNS($Q$3:S21)), \"\")","v":"実践活動"},{"$f":"IFERROR(INDEX($Q$3:$U$89, SMALL(IF($P$3:$P$89=\"○\", ROW($P$3:$P$89)-ROW($P$3)+1), ROW(D19)), COLUMNS($Q$3:T21)), \"\")","v":"水路"},{"$f":"IFERROR(INDEX($Q$3:$U$89, SMALL(IF($P$3:$P$89=\"○\", ROW($P$3:$P$89)-ROW($P$3)+1), ROW(E19)), COLUMNS($Q$3:U21)), \"\")","v":"101 配水操作"}]
[null,null,null,null,null,null,null,null,null,null,null,null,null,null,null,null,{"$f":"IFERROR(INDEX($Q$3:$U$89, SMALL(IF($P$3:$P$89=\"○\", ROW($P$3:$P$89)-ROW($P$3)+1), ROW(A20)), COLUMNS($Q$3:Q22)), \"\")","v":102},{"$f":"IFERROR(INDEX($Q$3:$U$89, SMALL(IF($P$3:$P$89=\"○\", ROW($P$3:$P$89)-ROW($P$3)+1), ROW(B20)), COLUMNS($Q$3:R22)), \"\")","v":"農地維持"},{"$f":"IFERROR(INDEX($Q$3:$U$89, SMALL(IF($P$3:$P$89=\"○\", ROW($P$3:$P$89)-ROW($P$3)+1), ROW(C20)), COLUMNS($Q$3:S22)), \"\")","v":"実践活動"},{"$f":"IFERROR(INDEX($Q$3:$U$89, SMALL(IF($P$3:$P$89=\"○\", ROW($P$3:$P$89)-ROW($P$3)+1), ROW(D20)), COLUMNS($Q$3:T22)), \"\")","v":"ため池"},{"$f":"IFERROR(INDEX($Q$3:$U$89, SMALL(IF($P$3:$P$89=\"○\", ROW($P$3:$P$89)-ROW($P$3)+1), ROW(E20)), COLUMNS($Q$3:U22)), \"\")","v":"102 配水操作"}]
[null,null,null,null,null,null,null,null,null,null,null,null,null,null,null,null,{"$f":"IFERROR(INDEX($Q$3:$U$89, SMALL(IF($P$3:$P$89=\"○\", ROW($P$3:$P$89)-ROW($P$3)+1), ROW(A21)), COLUMNS($Q$3:Q23)), \"\")","v":103},{"$f":"IFERROR(INDEX($Q$3:$U$89, SMALL(IF($P$3:$P$89=\"○\", ROW($P$3:$P$89)-ROW($P$3)+1), ROW(B21)), COLUMNS($Q$3:R23)), \"\")","v":"農地維持"},{"$f":"IFERROR(INDEX($Q$3:$U$89, SMALL(IF($P$3:$P$89=\"○\", ROW($P$3:$P$89)-ROW($P$3)+1), ROW(C21)), COLUMNS($Q$3:S23)), \"\")","v":"実践活動"},{"$f":"IFERROR(INDEX($Q$3:$U$89, SMALL(IF($P$3:$P$89=\"○\", ROW($P$3:$P$89)-ROW($P$3)+1), ROW(D21)), COLUMNS($Q$3:T23)), \"\")","v":"ため池"},{"$f":"IFERROR(INDEX($Q$3:$U$89, SMALL(IF($P$3:$P$89=\"○\", ROW($P$3:$P$89)-ROW($P$3)+1), ROW(E21)), COLUMNS($Q$3:U23)), \"\")","v":"103 鳥獣害防護柵の適正管理"}]
[null,null,null,null,null,null,null,null,null,null,null,null,null,null,null,null,{"$f":"IFERROR(INDEX($Q$3:$U$89, SMALL(IF($P$3:$P$89=\"○\", ROW($P$3:$P$89)-ROW($P$3)+1), ROW(A22)), COLUMNS($Q$3:Q24)), \"\")","v":104},{"$f":"IFERROR(INDEX($Q$3:$U$89, SMALL(IF($P$3:$P$89=\"○\", ROW($P$3:$P$89)-ROW($P$3)+1), ROW(B22)), COLUMNS($Q$3:R24)), \"\")","v":"共同"},{"$f":"IFERROR(INDEX($Q$3:$U$89, SMALL(IF($P$3:$P$89=\"○\", ROW($P$3:$P$89)-ROW($P$3)+1), ROW(C22)), COLUMNS($Q$3:S24)), \"\")","v":"実践活動"},{"$f":"IFERROR(INDEX($Q$3:$U$89, SMALL(IF($P$3:$P$89=\"○\", ROW($P$3:$P$89)-ROW($P$3)+1), ROW(D22)), COLUMNS($Q$3:T24)), \"\")","v":"農用地"},{"$f":"IFERROR(INDEX($Q$3:$U$89, SMALL(IF($P$3:$P$89=\"○\", ROW($P$3:$P$89)-ROW($P$3)+1), ROW(E22)), COLUMNS($Q$3:U24)), \"\")","v":"104 農用地進入路の補修"}]
[null,null,null,null,null,null,null,null,null,null,null,null,null,null,null,null,{"$f":"IFERROR(INDEX($Q$3:$U$89, SMALL(IF($P$3:$P$89=\"○\", ROW($P$3:$P$89)-ROW($P$3)+1), ROW(A23)), COLUMNS($Q$3:Q25)), \"\")","v":105},{"$f":"IFERROR(INDEX($Q$3:$U$89, SMALL(IF($P$3:$P$89=\"○\", ROW($P$3:$P$89)-ROW($P$3)+1), ROW(B23)), COLUMNS($Q$3:R25)), \"\")","v":"共同"},{"$f":"IFERROR(INDEX($Q$3:$U$89, SMALL(IF($P$3:$P$89=\"○\", ROW($P$3:$P$89)-ROW($P$3)+1), ROW(C23)), COLUMNS($Q$3:S25)), \"\")","v":"実践活動"},{"$f":"IFERROR(INDEX($Q$3:$U$89, SMALL(IF($P$3:$P$89=\"○\", ROW($P$3:$P$89)-ROW($P$3)+1), ROW(D23)), COLUMNS($Q$3:T25)), \"\")","v":"ため池"},{"$f":"IFERROR(INDEX($Q$3:$U$89, SMALL(IF($P$3:$P$89=\"○\", ROW($P$3:$P$89)-ROW($P$3)+1), ROW(E23)), COLUMNS($Q$3:U25)), \"\")","v":"105 鳥獣害防護柵の補修・設置"}]
[null,null,null,null,null,null,null,null,null,null,null,null,null,null,null,null,{"$f":"IFERROR(INDEX($Q$3:$U$89, SMALL(IF($P$3:$P$89=\"○\", ROW($P$3:$P$89)-ROW($P$3)+1), ROW(A24)), COLUMNS($Q$3:Q26)), \"\")","v":106},{"$f":"IFERROR(INDEX($Q$3:$U$89, SMALL(IF($P$3:$P$89=\"○\", ROW($P$3:$P$89)-ROW($P$3)+1), ROW(B24)), COLUMNS($Q$3:R26)), \"\")","v":"共同"},{"$f":"IFERROR(INDEX($Q$3:$U$89, SMALL(IF($P$3:$P$89=\"○\", ROW($P$3:$P$89)-ROW($P$3)+1), ROW(C24)), COLUMNS($Q$3:S26)), \"\")","v":"実践活動"},{"$f":"IFERROR(INDEX($Q$3:$U$89, SMALL(IF($P$3:$P$89=\"○\", ROW($P$3:$P$89)-ROW($P$3)+1), ROW(D24)), COLUMNS($Q$3:T26)), \"\")","v":"水質保全"},{"$f":"IFERROR(INDEX($Q$3:$U$89, SMALL(IF($P$3:$P$89=\"○\", ROW($P$3:$P$89)-ROW($P$3)+1), ROW(E24)), COLUMNS($Q$3:U26)), \"\")","v":"106 水質の保全を図る施設の適正管理"}]
[null,null,null,null,null,null,null,null,null,null,null,null,null,null,null,null,{"$f":"IFERROR(INDEX($Q$3:$U$89, SMALL(IF($P$3:$P$89=\"○\", ROW($P$3:$P$89)-ROW($P$3)+1), ROW(A25)), COLUMNS($Q$3:Q27)), \"\")","v":107},{"$f":"IFERROR(INDEX($Q$3:$U$89, SMALL(IF($P$3:$P$89=\"○\", ROW($P$3:$P$89)-ROW($P$3)+1), ROW(B25)), COLUMNS($Q$3:R27)), \"\")","v":"長寿命化"},{"$f":"IFERROR(INDEX($Q$3:$U$89, SMALL(IF($P$3:$P$89=\"○\", ROW($P$3:$P$89)-ROW($P$3)+1), ROW(C25)), COLUMNS($Q$3:S27)), \"\")","v":"実践活動"},{"$f":"IFERROR(INDEX($Q$3:$U$89, SMALL(IF($P$3:$P$89=\"○\", ROW($P$3:$P$89)-ROW($P$3)+1), ROW(D25)), COLUMNS($Q$3:T27)), \"\")","v":"水路"},{"$f":"IFERROR(INDEX($Q$3:$U$89, SMALL(IF($P$3:$P$89=\"○\", ROW($P$3:$P$89)-ROW($P$3)+1), ROW(E25)), COLUMNS($Q$3:U27)), \"\")","v":"107 水路法面の補修"}]
[null,null,null,null,null,null,null,null,null,null,null,null,null,null,null,null,{"$f":"IFERROR(INDEX($Q$3:$U$89, SMALL(IF($P$3:$P$89=\"○\", ROW($P$3:$P$89)-ROW($P$3)+1), ROW(A26)), COLUMNS($Q$3:Q28)), \"\")","v":108},{"$f":"IFERROR(INDEX($Q$3:$U$89, SMALL(IF($P$3:$P$89=\"○\", ROW($P$3:$P$89)-ROW($P$3)+1), ROW(B26)), COLUMNS($Q$3:R28)), \"\")","v":"長寿命化"},{"$f":"IFERROR(INDEX($Q$3:$U$89, SMALL(IF($P$3:$P$89=\"○\", ROW($P$3:$P$89)-ROW($P$3)+1), ROW(C26)), COLUMNS($Q$3:S28)), \"\")","v":"実践活動"},{"$f":"IFERROR(INDEX($Q$3:$U$89, SMALL(IF($P$3:$P$89=\"○\", ROW($P$3:$P$89)-ROW($P$3)+1), ROW(D26)), COLUMNS($Q$3:T28)), \"\")","v":"水路"},{"$f":"IFERROR(INDEX($Q$3:$U$89, SMALL(IF($P$3:$P$89=\"○\", ROW($P$3:$P$89)-ROW($P$3)+1), ROW(E26)), COLUMNS($Q$3:U28)), \"\")","v":"108 取水施設の補修"}]
[null,null,null,null,null,null,null,null,null,null,null,null,null,null,null,null,{"$f":"IFERROR(INDEX($Q$3:$U$89, SMALL(IF($P$3:$P$89=\"○\", ROW($P$3:$P$89)-ROW($P$3)+1), ROW(A27)), COLUMNS($Q$3:Q29)), \"\")","v":109},{"$f":"IFERROR(INDEX($Q$3:$U$89, SMALL(IF($P$3:$P$89=\"○\", ROW($P$3:$P$89)-ROW($P$3)+1), ROW(B27)), COLUMNS($Q$3:R29)), \"\")","v":"長寿命化"},{"$f":"IFERROR(INDEX($Q$3:$U$89, SMALL(IF($P$3:$P$89=\"○\", ROW($P$3:$P$89)-ROW($P$3)+1), ROW(C27)), COLUMNS($Q$3:S29)), \"\")","v":"実践活動"},{"$f":"IFERROR(INDEX($Q$3:$U$89, SMALL(IF($P$3:$P$89=\"○\", ROW($P$3:$P$89)-ROW($P$3)+1), ROW(D27)), COLUMNS($Q$3:T29)), \"\")","v":"農地に係る施設"},{"$f":"IFERROR(INDEX($Q$3:$U$89, SMALL(IF($P$3:$P$89=\"○\", ROW($P$3:$P$89)-ROW($P$3)+1), ROW(E27)), COLUMNS($Q$3:U29)), \"\")","v":"109 農地に係る施設の補修"}]
[null,null,null,null,null,null,null,null,null,null,null,null,null,null,null,null,{"$f":"IFERROR(INDEX($Q$3:$U$89, SMALL(IF($P$3:$P$89=\"○\", ROW($P$3:$P$89)-ROW($P$3)+1), ROW(A28)), COLUMNS($Q$3:Q30)), \"\")","v":110},{"$f":"IFERROR(INDEX($Q$3:$U$89, SMALL(IF($P$3:$P$89=\"○\", ROW($P$3:$P$89)-ROW($P$3)+1), ROW(B28)), COLUMNS($Q$3:R30)), \"\")","v":"長寿命化"},{"$f":"IFERROR(INDEX($Q$3:$U$89, SMALL(IF($P$3:$P$89=\"○\", ROW($P$3:$P$89)-ROW($P$3)+1), ROW(C28)), COLUMNS($Q$3:S30)), \"\")","v":"実践活動"},{"$f":"IFERROR(INDEX($Q$3:$U$89, SMALL(IF($P$3:$P$89=\"○\", ROW($P$3:$P$89)-ROW($P$3)+1), ROW(D28)), COLUMNS($Q$3:T30)), \"\")","v":"農地に係る施設"},{"$f":"IFERROR(INDEX($Q$3:$U$89, SMALL(IF($P$3:$P$89=\"○\", ROW($P$3:$P$89)-ROW($P$3)+1), ROW(E28)), COLUMNS($Q$3:U30)), \"\")","v":"110 農地に係る施設の更新等"}]
[null,null,null,null,null,null,null,null,null,null,null,null,null,null,null,null,{"$f":"IFERROR(INDEX($Q$3:$U$89, SMALL(IF($P$3:$P$89=\"○\", ROW($P$3:$P$89)-ROW($P$3)+1), ROW(A29)), COLUMNS($Q$3:Q31)), \"\")","v":111},{"$f":"IFERROR(INDEX($Q$3:$U$89, SMALL(IF($P$3:$P$89=\"○\", ROW($P$3:$P$89)-ROW($P$3)+1), ROW(B29)), COLUMNS($Q$3:R31)), \"\")","v":"長寿命化"},{"$f":"IFERROR(INDEX($Q$3:$U$89, SMALL(IF($P$3:$P$89=\"○\", ROW($P$3:$P$89)-ROW($P$3)+1), ROW(C29)), COLUMNS($Q$3:S31)), \"\")","v":"実践活動"},{"$f":"IFERROR(INDEX($Q$3:$U$89, SMALL(IF($P$3:$P$89=\"○\", ROW($P$3:$P$89)-ROW($P$3)+1), ROW(D29)), COLUMNS($Q$3:T31)), \"\")","v":"農地に係る施設"},{"$f":"IFERROR(INDEX($Q$3:$U$89, SMALL(IF($P$3:$P$89=\"○\", ROW($P$3:$P$89)-ROW($P$3)+1), ROW(E29)), COLUMNS($Q$3:U31)), \"\")","v":"111 農用地進入路の更新等"}]
[null,null,null,null,null,null,null,null,null,null,null,null,null,null,null,null,{"$f":"IFERROR(INDEX($Q$3:$U$89, SMALL(IF($P$3:$P$89=\"○\", ROW($P$3:$P$89)-ROW($P$3)+1), ROW(A30)), COLUMNS($Q$3:Q32)), \"\")","v":0},{"$f":"IFERROR(INDEX($Q$3:$U$89, SMALL(IF($P$3:$P$89=\"○\", ROW($P$3:$P$89)-ROW($P$3)+1), ROW(B30)), COLUMNS($Q$3:R32)), \"\")","v":0},{"$f":"IFERROR(INDEX($Q$3:$U$89, SMALL(IF($P$3:$P$89=\"○\", ROW($P$3:$P$89)-ROW($P$3)+1), ROW(C30)), COLUMNS($Q$3:S32)), \"\")","v":0},{"$f":"IFERROR(INDEX($Q$3:$U$89, SMALL(IF($P$3:$P$89=\"○\", ROW($P$3:$P$89)-ROW($P$3)+1), ROW(D30)), COLUMNS($Q$3:T32)), \"\")","v":0},{"$f":"IFERROR(INDEX($Q$3:$U$89, SMALL(IF($P$3:$P$89=\"○\", ROW($P$3:$P$89)-ROW($P$3)+1), ROW(E30)), COLUMNS($Q$3:U32)), \"\")","v":0}]
[null,null,null,null,null,null,null,null,null,null,null,null,null,null,null,null,{"$f":"IFERROR(INDEX($Q$3:$U$89, SMALL(IF($P$3:$P$89=\"○\", ROW($P$3:$P$89)-ROW($P$3)+1), ROW(A31)), COLUMNS($Q$3:Q33)), \"\")","v":0},{"$f":"IFERROR(INDEX($Q$3:$U$89, SMALL(IF($P$3:$P$89=\"○\", ROW($P$3:$P$89)-ROW($P$3)+1), ROW(B31)), COLUMNS($Q$3:R33)), \"\")","v":0},{"$f":"IFERROR(INDEX($Q$3:$U$89, SMALL(IF($P$3:$P$89=\"○\", ROW($P$3:$P$89)-ROW($P$3)+1), ROW(C31)), COLUMNS($Q$3:S33)), \"\")","v":0},{"$f":"IFERROR(INDEX($Q$3:$U$89, SMALL(IF($P$3:$P$89=\"○\", ROW($P$3:$P$89)-ROW($P$3)+1), ROW(D31)), COLUMNS($Q$3:T33)), \"\")","v":0},{"$f":"IFERROR(INDEX($Q$3:$U$89, SMALL(IF($P$3:$P$89=\"○\", ROW($P$3:$P$89)-ROW($P$3)+1), ROW(E31)), COLUMNS($Q$3:U33)), \"\")","v":0}]
[null,null,null,null,null,null,null,null,null,null,null,null,null,null,null,null,{"$f":"IFERROR(INDEX($Q$3:$U$89, SMALL(IF($P$3:$P$89=\"○\", ROW($P$3:$P$89)-ROW($P$3)+1), ROW(A32)), COLUMNS($Q$3:Q34)), \"\")","v":0},{"$f":"IFERROR(INDEX($Q$3:$U$89, SMALL(IF($P$3:$P$89=\"○\", ROW($P$3:$P$89)-ROW($P$3)+1), ROW(B32)), COLUMNS($Q$3:R34)), \"\")","v":0},{"$f":"IFERROR(INDEX($Q$3:$U$89, SMALL(IF($P$3:$P$89=\"○\", ROW($P$3:$P$89)-ROW($P$3)+1), ROW(C32)), COLUMNS($Q$3:S34)), \"\")","v":0},{"$f":"IFERROR(INDEX($Q$3:$U$89, SMALL(IF($P$3:$P$89=\"○\", ROW($P$3:$P$89)-ROW($P$3)+1), ROW(D32)), COLUMNS($Q$3:T34)), \"\")","v":0},{"$f":"IFERROR(INDEX($Q$3:$U$89, SMALL(IF($P$3:$P$89=\"○\", ROW($P$3:$P$89)-ROW($P$3)+1), ROW(E32)), COLUMNS($Q$3:U34)), \"\")","v":0}]
[null,null,null,null,null,null,null,null,null,null,null,null,null,null,null,null,{"$f":"IFERROR(INDEX($Q$3:$U$89, SMALL(IF($P$3:$P$89=\"○\", ROW($P$3:$P$89)-ROW($P$3)+1), ROW(A33)), COLUMNS($Q$3:Q35)), \"\")","v":0},{"$f":"IFERROR(INDEX($Q$3:$U$89, SMALL(IF($P$3:$P$89=\"○\", ROW($P$3:$P$89)-ROW($P$3)+1), ROW(B33)), COLUMNS($Q$3:R35)), \"\")","v":0},{"$f":"IFERROR(INDEX($Q$3:$U$89, SMALL(IF($P$3:$P$89=\"○\", ROW($P$3:$P$89)-ROW($P$3)+1), ROW(C33)), COLUMNS($Q$3:S35)), \"\")","v":0},{"$f":"IFERROR(INDEX($Q$3:$U$89, SMALL(IF($P$3:$P$89=\"○\", ROW($P$3:$P$89)-ROW($P$3)+1), ROW(D33)), COLUMNS($Q$3:T35)), \"\")","v":0},{"$f":"IFERROR(INDEX($Q$3:$U$89, SMALL(IF($P$3:$P$89=\"○\", ROW($P$3:$P$89)-ROW($P$3)+1), ROW(E33)), COLUMNS($Q$3:U35)), \"\")","v":0}]
[null,null,null,null,null,null,null,null,null,null,null,null,null,null,null,null,{"$f":"IFERROR(INDEX($Q$3:$U$89, SMALL(IF($P$3:$P$89=\"○\", ROW($P$3:$P$89)-ROW($P$3)+1), ROW(A34)), COLUMNS($Q$3:Q36)), \"\")","v":""},{"$f":"IFERROR(INDEX($Q$3:$U$89, SMALL(IF($P$3:$P$89=\"○\", ROW($P$3:$P$89)-ROW($P$3)+1), ROW(B34)), COLUMNS($Q$3:R36)), \"\")","v":""},{"$f":"IFERROR(INDEX($Q$3:$U$89, SMALL(IF($P$3:$P$89=\"○\", ROW($P$3:$P$89)-ROW($P$3)+1), ROW(C34)), COLUMNS($Q$3:S36)), \"\")","v":""},{"$f":"IFERROR(INDEX($Q$3:$U$89, SMALL(IF($P$3:$P$89=\"○\", ROW($P$3:$P$89)-ROW($P$3)+1), ROW(D34)), COLUMNS($Q$3:T36)), \"\")","v":""},{"$f":"IFERROR(INDEX($Q$3:$U$89, SMALL(IF($P$3:$P$89=\"○\", ROW($P$3:$P$89)-ROW($P$3)+1), ROW(E34)), COLUMNS($Q$3:U36)), \"\")","v":""}]
[null,null,null,null,null,null,null,null,null,null,null,null,null,null,null,null,{"$f":"IFERROR(INDEX($Q$3:$U$89, SMALL(IF($P$3:$P$89=\"○\", ROW($P$3:$P$89)-ROW($P$3)+1), ROW(A35)), COLUMNS($Q$3:Q37)), \"\")","v":""},{"$f":"IFERROR(INDEX($Q$3:$U$89, SMALL(IF($P$3:$P$89=\"○\", ROW($P$3:$P$89)-ROW($P$3)+1), ROW(B35)), COLUMNS($Q$3:R37)), \"\")","v":""},{"$f":"IFERROR(INDEX($Q$3:$U$89, SMALL(IF($P$3:$P$89=\"○\", ROW($P$3:$P$89)-ROW($P$3)+1), ROW(C35)), COLUMNS($Q$3:S37)), \"\")","v":""},{"$f":"IFERROR(INDEX($Q$3:$U$89, SMALL(IF($P$3:$P$89=\"○\", ROW($P$3:$P$89)-ROW($P$3)+1), ROW(D35)), COLUMNS($Q$3:T37)), \"\")","v":""},{"$f":"IFERROR(INDEX($Q$3:$U$89, SMALL(IF($P$3:$P$89=\"○\", ROW($P$3:$P$89)-ROW($P$3)+1), ROW(E35)), COLUMNS($Q$3:U37)), \"\")","v":""}]
[null,null,null,null,null,null,null,null,null,null,null,null,null,null,null,null,{"$f":"IFERROR(INDEX($Q$3:$U$89, SMALL(IF($P$3:$P$89=\"○\", ROW($P$3:$P$89)-ROW($P$3)+1), ROW(A36)), COLUMNS($Q$3:Q38)), \"\")","v":""},{"$f":"IFERROR(INDEX($Q$3:$U$89, SMALL(IF($P$3:$P$89=\"○\", ROW($P$3:$P$89)-ROW($P$3)+1), ROW(B36)), COLUMNS($Q$3:R38)), \"\")","v":""},{"$f":"IFERROR(INDEX($Q$3:$U$89, SMALL(IF($P$3:$P$89=\"○\", ROW($P$3:$P$89)-ROW($P$3)+1), ROW(C36)), COLUMNS($Q$3:S38)), \"\")","v":""},{"$f":"IFERROR(INDEX($Q$3:$U$89, SMALL(IF($P$3:$P$89=\"○\", ROW($P$3:$P$89)-ROW($P$3)+1), ROW(D36)), COLUMNS($Q$3:T38)), \"\")","v":""},{"$f":"IFERROR(INDEX($Q$3:$U$89, SMALL(IF($P$3:$P$89=\"○\", ROW($P$3:$P$89)-ROW($P$3)+1), ROW(E36)), COLUMNS($Q$3:U38)), \"\")","v":""}]
[null,null,null,null,null,null,null,null,null,null,null,null,null,null,null,null,{"$f":"IFERROR(INDEX($Q$3:$U$89, SMALL(IF($P$3:$P$89=\"○\", ROW($P$3:$P$89)-ROW($P$3)+1), ROW(A37)), COLUMNS($Q$3:Q39)), \"\")","v":""},{"$f":"IFERROR(INDEX($Q$3:$U$89, SMALL(IF($P$3:$P$89=\"○\", ROW($P$3:$P$89)-ROW($P$3)+1), ROW(B37)), COLUMNS($Q$3:R39)), \"\")","v":""},{"$f":"IFERROR(INDEX($Q$3:$U$89, SMALL(IF($P$3:$P$89=\"○\", ROW($P$3:$P$89)-ROW($P$3)+1), ROW(C37)), COLUMNS($Q$3:S39)), \"\")","v":""},{"$f":"IFERROR(INDEX($Q$3:$U$89, SMALL(IF($P$3:$P$89=\"○\", ROW($P$3:$P$89)-ROW($P$3)+1), ROW(D37)), COLUMNS($Q$3:T39)), \"\")","v":""},{"$f":"IFERROR(INDEX($Q$3:$U$89, SMALL(IF($P$3:$P$89=\"○\", ROW($P$3:$P$89)-ROW($P$3)+1), ROW(E37)), COLUMNS($Q$3:U39)), \"\")","v":""}]
[null,null,null,null,null,null,null,null,null,null,null,null,null,null,null,null,{"$f":"IFERROR(INDEX($Q$3:$U$89, SMALL(IF($P$3:$P$89=\"○\", ROW($P$3:$P$89)-ROW($P$3)+1), ROW(A38)), COLUMNS($Q$3:Q40)), \"\")","v":""},{"$f":"IFERROR(INDEX($Q$3:$U$89, SMALL(IF($P$3:$P$89=\"○\", ROW($P$3:$P$89)-ROW($P$3)+1), ROW(B38)), COLUMNS($Q$3:R40)), \"\")","v":""},{"$f":"IFERROR(INDEX($Q$3:$U$89, SMALL(IF($P$3:$P$89=\"○\", ROW($P$3:$P$89)-ROW($P$3)+1), ROW(C38)), COLUMNS($Q$3:S40)), \"\")","v":""},{"$f":"IFERROR(INDEX($Q$3:$U$89, SMALL(IF($P$3:$P$89=\"○\", ROW($P$3:$P$89)-ROW($P$3)+1), ROW(D38)), COLUMNS($Q$3:T40)), \"\")","v":""},{"$f":"IFERROR(INDEX($Q$3:$U$89, SMALL(IF($P$3:$P$89=\"○\", ROW($P$3:$P$89)-ROW($P$3)+1), ROW(E38)), COLUMNS($Q$3:U40)), \"\")","v":""}]
[null,null,null,null,null,null,null,null,null,null,null,null,null,null,null,null,{"$f":"IFERROR(INDEX($Q$3:$U$89, SMALL(IF($P$3:$P$89=\"○\", ROW($P$3:$P$89)-ROW($P$3)+1), ROW(A39)), COLUMNS($Q$3:Q41)), \"\")","v":""},{"$f":"IFERROR(INDEX($Q$3:$U$89, SMALL(IF($P$3:$P$89=\"○\", ROW($P$3:$P$89)-ROW($P$3)+1), ROW(B39)), COLUMNS($Q$3:R41)), \"\")","v":""},{"$f":"IFERROR(INDEX($Q$3:$U$89, SMALL(IF($P$3:$P$89=\"○\", ROW($P$3:$P$89)-ROW($P$3)+1), ROW(C39)), COLUMNS($Q$3:S41)), \"\")","v":""},{"$f":"IFERROR(INDEX($Q$3:$U$89, SMALL(IF($P$3:$P$89=\"○\", ROW($P$3:$P$89)-ROW($P$3)+1), ROW(D39)), COLUMNS($Q$3:T41)), \"\")","v":""},{"$f":"IFERROR(INDEX($Q$3:$U$89, SMALL(IF($P$3:$P$89=\"○\", ROW($P$3:$P$89)-ROW($P$3)+1), ROW(E39)), COLUMNS($Q$3:U41)), \"\")","v":""}]
[null,null,null,null,null,null,null,null,null,null,null,null,null,null,null,null,{"$f":"IFERROR(INDEX($Q$3:$U$89, SMALL(IF($P$3:$P$89=\"○\", ROW($P$3:$P$89)-ROW($P$3)+1), ROW(A40)), COLUMNS($Q$3:Q42)), \"\")","v":""},{"$f":"IFERROR(INDEX($Q$3:$U$89, SMALL(IF($P$3:$P$89=\"○\", ROW($P$3:$P$89)-ROW($P$3)+1), ROW(B40)), COLUMNS($Q$3:R42)), \"\")","v":""},{"$f":"IFERROR(INDEX($Q$3:$U$89, SMALL(IF($P$3:$P$89=\"○\", ROW($P$3:$P$89)-ROW($P$3)+1), ROW(C40)), COLUMNS($Q$3:S42)), \"\")","v":""},{"$f":"IFERROR(INDEX($Q$3:$U$89, SMALL(IF($P$3:$P$89=\"○\", ROW($P$3:$P$89)-ROW($P$3)+1), ROW(D40)), COLUMNS($Q$3:T42)), \"\")","v":""},{"$f":"IFERROR(INDEX($Q$3:$U$89, SMALL(IF($P$3:$P$89=\"○\", ROW($P$3:$P$89)-ROW($P$3)+1), ROW(E40)), COLUMNS($Q$3:U42)), \"\")","v":""}]
[null,null,null,null,null,null,null,null,null,null,null,null,null,null,null,null,{"$f":"IFERROR(INDEX($Q$3:$U$89, SMALL(IF($P$3:$P$89=\"○\", ROW($P$3:$P$89)-ROW($P$3)+1), ROW(A41)), COLUMNS($Q$3:Q43)), \"\")","v":""},{"$f":"IFERROR(INDEX($Q$3:$U$89, SMALL(IF($P$3:$P$89=\"○\", ROW($P$3:$P$89)-ROW($P$3)+1), ROW(B41)), COLUMNS($Q$3:R43)), \"\")","v":""},{"$f":"IFERROR(INDEX($Q$3:$U$89, SMALL(IF($P$3:$P$89=\"○\", ROW($P$3:$P$89)-ROW($P$3)+1), ROW(C41)), COLUMNS($Q$3:S43)), \"\")","v":""},{"$f":"IFERROR(INDEX($Q$3:$U$89, SMALL(IF($P$3:$P$89=\"○\", ROW($P$3:$P$89)-ROW($P$3)+1), ROW(D41)), COLUMNS($Q$3:T43)), \"\")","v":""},{"$f":"IFERROR(INDEX($Q$3:$U$89, SMALL(IF($P$3:$P$89=\"○\", ROW($P$3:$P$89)-ROW($P$3)+1), ROW(E41)), COLUMNS($Q$3:U43)), \"\")","v":""}]
[null,null,null,null,null,null,null,null,null,null,null,null,null,null,null,null,{"$f":"IFERROR(INDEX($Q$3:$U$89, SMALL(IF($P$3:$P$89=\"○\", ROW($P$3:$P$89)-ROW($P$3)+1), ROW(A42)), COLUMNS($Q$3:Q44)), \"\")","v":""},{"$f":"IFERROR(INDEX($Q$3:$U$89, SMALL(IF($P$3:$P$89=\"○\", ROW($P$3:$P$89)-ROW($P$3)+1), ROW(B42)), COLUMNS($Q$3:R44)), \"\")","v":""},{"$f":"IFERROR(INDEX($Q$3:$U$89, SMALL(IF($P$3:$P$89=\"○\", ROW($P$3:$P$89)-ROW($P$3)+1), ROW(C42)), COLUMNS($Q$3:S44)), \"\")","v":""},{"$f":"IFERROR(INDEX($Q$3:$U$89, SMALL(IF($P$3:$P$89=\"○\", ROW($P$3:$P$89)-ROW($P$3)+1), ROW(D42)), COLUMNS($Q$3:T44)), \"\")","v":""},{"$f":"IFERROR(INDEX($Q$3:$U$89, SMALL(IF($P$3:$P$89=\"○\", ROW($P$3:$P$89)-ROW($P$3)+1), ROW(E42)), COLUMNS($Q$3:U44)), \"\")","v":""}]
[null,null,null,null,null,null,null,null,null,null,null,null,null,null,null,null,{"$f":"IFERROR(INDEX($Q$3:$U$89, SMALL(IF($P$3:$P$89=\"○\", ROW($P$3:$P$89)-ROW($P$3)+1), ROW(A43)), COLUMNS($Q$3:Q45)), \"\")","v":""},{"$f":"IFERROR(INDEX($Q$3:$U$89, SMALL(IF($P$3:$P$89=\"○\", ROW($P$3:$P$89)-ROW($P$3)+1), ROW(B43)), COLUMNS($Q$3:R45)), \"\")","v":""},{"$f":"IFERROR(INDEX($Q$3:$U$89, SMALL(IF($P$3:$P$89=\"○\", ROW($P$3:$P$89)-ROW($P$3)+1), ROW(C43)), COLUMNS($Q$3:S45)), \"\")","v":""},{"$f":"IFERROR(INDEX($Q$3:$U$89, SMALL(IF($P$3:$P$89=\"○\", ROW($P$3:$P$89)-ROW($P$3)+1), ROW(D43)), COLUMNS($Q$3:T45)), \"\")","v":""},{"$f":"IFERROR(INDEX($Q$3:$U$89, SMALL(IF($P$3:$P$89=\"○\", ROW($P$3:$P$89)-ROW($P$3)+1), ROW(E43)), COLUMNS($Q$3:U45)), \"\")","v":""}]
[null,null,null,null,null,null,null,null,null,null,null,null,null,null,null,null,{"$f":"IFERROR(INDEX($Q$3:$U$89, SMALL(IF($P$3:$P$89=\"○\", ROW($P$3:$P$89)-ROW($P$3)+1), ROW(A44)), COLUMNS($Q$3:Q46)), \"\")","v":""},{"$f":"IFERROR(INDEX($Q$3:$U$89, SMALL(IF($P$3:$P$89=\"○\", ROW($P$3:$P$89)-ROW($P$3)+1), ROW(B44)), COLUMNS($Q$3:R46)), \"\")","v":""},{"$f":"IFERROR(INDEX($Q$3:$U$89, SMALL(IF($P$3:$P$89=\"○\", ROW($P$3:$P$89)-ROW($P$3)+1), ROW(C44)), COLUMNS($Q$3:S46)), \"\")","v":""},{"$f":"IFERROR(INDEX($Q$3:$U$89, SMALL(IF($P$3:$P$89=\"○\", ROW($P$3:$P$89)-ROW($P$3)+1), ROW(D44)), COLUMNS($Q$3:T46)), \"\")","v":""},{"$f":"IFERROR(INDEX($Q$3:$U$89, SMALL(IF($P$3:$P$89=\"○\", ROW($P$3:$P$89)-ROW($P$3)+1), ROW(E44)), COLUMNS($Q$3:U46)), \"\")","v":""}]
[null,null,null,null,null,null,null,null,null,null,null,null,null,null,null,null,{"$f":"IFERROR(INDEX($Q$3:$U$89, SMALL(IF($P$3:$P$89=\"○\", ROW($P$3:$P$89)-ROW($P$3)+1), ROW(A45)), COLUMNS($Q$3:Q47)), \"\")","v":""},{"$f":"IFERROR(INDEX($Q$3:$U$89, SMALL(IF($P$3:$P$89=\"○\", ROW($P$3:$P$89)-ROW($P$3)+1), ROW(B45)), COLUMNS($Q$3:R47)), \"\")","v":""},{"$f":"IFERROR(INDEX($Q$3:$U$89, SMALL(IF($P$3:$P$89=\"○\", ROW($P$3:$P$89)-ROW($P$3)+1), ROW(C45)), COLUMNS($Q$3:S47)), \"\")","v":""},{"$f":"IFERROR(INDEX($Q$3:$U$89, SMALL(IF($P$3:$P$89=\"○\", ROW($P$3:$P$89)-ROW($P$3)+1), ROW(D45)), COLUMNS($Q$3:T47)), \"\")","v":""},{"$f":"IFERROR(INDEX($Q$3:$U$89, SMALL(IF($P$3:$P$89=\"○\", ROW($P$3:$P$89)-ROW($P$3)+1), ROW(E45)), COLUMNS($Q$3:U47)), \"\")","v":""}]
[null,null,null,null,null,null,null,null,null,null,null,null,null,null,null,null,{"$f":"IFERROR(INDEX($Q$3:$U$89, SMALL(IF($P$3:$P$89=\"○\", ROW($P$3:$P$89)-ROW($P$3)+1), ROW(A46)), COLUMNS($Q$3:Q48)), \"\")","v":""},{"$f":"IFERROR(INDEX($Q$3:$U$89, SMALL(IF($P$3:$P$89=\"○\", ROW($P$3:$P$89)-ROW($P$3)+1), ROW(B46)), COLUMNS($Q$3:R48)), \"\")","v":""},{"$f":"IFERROR(INDEX($Q$3:$U$89, SMALL(IF($P$3:$P$89=\"○\", ROW($P$3:$P$89)-ROW($P$3)+1), ROW(C46)), COLUMNS($Q$3:S48)), \"\")","v":""},{"$f":"IFERROR(INDEX($Q$3:$U$89, SMALL(IF($P$3:$P$89=\"○\", ROW($P$3:$P$89)-ROW($P$3)+1), ROW(D46)), COLUMNS($Q$3:T48)), \"\")","v":""},{"$f":"IFERROR(INDEX($Q$3:$U$89, SMALL(IF($P$3:$P$89=\"○\", ROW($P$3:$P$89)-ROW($P$3)+1), ROW(E46)), COLUMNS($Q$3:U48)), \"\")","v":""}]
[null,null,null,null,null,null,null,null,null,null,null,null,null,null,null,null,{"$f":"IFERROR(INDEX($Q$3:$U$89, SMALL(IF($P$3:$P$89=\"○\", ROW($P$3:$P$89)-ROW($P$3)+1), ROW(A47)), COLUMNS($Q$3:Q49)), \"\")","v":""},{"$f":"IFERROR(INDEX($Q$3:$U$89, SMALL(IF($P$3:$P$89=\"○\", ROW($P$3:$P$89)-ROW($P$3)+1), ROW(B47)), COLUMNS($Q$3:R49)), \"\")","v":""},{"$f":"IFERROR(INDEX($Q$3:$U$89, SMALL(IF($P$3:$P$89=\"○\", ROW($P$3:$P$89)-ROW($P$3)+1), ROW(C47)), COLUMNS($Q$3:S49)), \"\")","v":""},{"$f":"IFERROR(INDEX($Q$3:$U$89, SMALL(IF($P$3:$P$89=\"○\", ROW($P$3:$P$89)-ROW($P$3)+1), ROW(D47)), COLUMNS($Q$3:T49)), \"\")","v":""},{"$f":"IFERROR(INDEX($Q$3:$U$89, SMALL(IF($P$3:$P$89=\"○\", ROW($P$3:$P$89)-ROW($P$3)+1), ROW(E47)), COLUMNS($Q$3:U49)), \"\")","v":""}]
[null,null,null,null,null,null,null,null,null,null,null,null,null,null,null,null,{"$f":"IFERROR(INDEX($Q$3:$U$89, SMALL(IF($P$3:$P$89=\"○\", ROW($P$3:$P$89)-ROW($P$3)+1), ROW(A48)), COLUMNS($Q$3:Q50)), \"\")","v":""},{"$f":"IFERROR(INDEX($Q$3:$U$89, SMALL(IF($P$3:$P$89=\"○\", ROW($P$3:$P$89)-ROW($P$3)+1), ROW(B48)), COLUMNS($Q$3:R50)), \"\")","v":""},{"$f":"IFERROR(INDEX($Q$3:$U$89, SMALL(IF($P$3:$P$89=\"○\", ROW($P$3:$P$89)-ROW($P$3)+1), ROW(C48)), COLUMNS($Q$3:S50)), \"\")","v":""},{"$f":"IFERROR(INDEX($Q$3:$U$89, SMALL(IF($P$3:$P$89=\"○\", ROW($P$3:$P$89)-ROW($P$3)+1), ROW(D48)), COLUMNS($Q$3:T50)), \"\")","v":""},{"$f":"IFERROR(INDEX($Q$3:$U$89, SMALL(IF($P$3:$P$89=\"○\", ROW($P$3:$P$89)-ROW($P$3)+1), ROW(E48)), COLUMNS($Q$3:U50)), \"\")","v":""}]
[null,null,null,null,null,null,null,null,null,null,null,null,null,null,null,null,{"$f":"IFERROR(INDEX($Q$3:$U$89, SMALL(IF($P$3:$P$89=\"○\", ROW($P$3:$P$89)-ROW($P$3)+1), ROW(A49)), COLUMNS($Q$3:Q51)), \"\")","v":""},{"$f":"IFERROR(INDEX($Q$3:$U$89, SMALL(IF($P$3:$P$89=\"○\", ROW($P$3:$P$89)-ROW($P$3)+1), ROW(B49)), COLUMNS($Q$3:R51)), \"\")","v":""},{"$f":"IFERROR(INDEX($Q$3:$U$89, SMALL(IF($P$3:$P$89=\"○\", ROW($P$3:$P$89)-ROW($P$3)+1), ROW(C49)), COLUMNS($Q$3:S51)), \"\")","v":""},{"$f":"IFERROR(INDEX($Q$3:$U$89, SMALL(IF($P$3:$P$89=\"○\", ROW($P$3:$P$89)-ROW($P$3)+1), ROW(D49)), COLUMNS($Q$3:T51)), \"\")","v":""},{"$f":"IFERROR(INDEX($Q$3:$U$89, SMALL(IF($P$3:$P$89=\"○\", ROW($P$3:$P$89)-ROW($P$3)+1), ROW(E49)), COLUMNS($Q$3:U51)), \"\")","v":""}]
[null,null,null,null,null,null,null,null,null,null,null,null,null,null,null,null,{"$f":"IFERROR(INDEX($Q$3:$U$89, SMALL(IF($P$3:$P$89=\"○\", ROW($P$3:$P$89)-ROW($P$3)+1), ROW(A50)), COLUMNS($Q$3:Q52)), \"\")","v":""},{"$f":"IFERROR(INDEX($Q$3:$U$89, SMALL(IF($P$3:$P$89=\"○\", ROW($P$3:$P$89)-ROW($P$3)+1), ROW(B50)), COLUMNS($Q$3:R52)), \"\")","v":""},{"$f":"IFERROR(INDEX($Q$3:$U$89, SMALL(IF($P$3:$P$89=\"○\", ROW($P$3:$P$89)-ROW($P$3)+1), ROW(C50)), COLUMNS($Q$3:S52)), \"\")","v":""},{"$f":"IFERROR(INDEX($Q$3:$U$89, SMALL(IF($P$3:$P$89=\"○\", ROW($P$3:$P$89)-ROW($P$3)+1), ROW(D50)), COLUMNS($Q$3:T52)), \"\")","v":""},{"$f":"IFERROR(INDEX($Q$3:$U$89, SMALL(IF($P$3:$P$89=\"○\", ROW($P$3:$P$89)-ROW($P$3)+1), ROW(E50)), COLUMNS($Q$3:U52)), \"\")","v":""}]
[null,null,null,null,null,null,null,null,null,null,null,null,null,null,null,null,{"$f":"IFERROR(INDEX($Q$3:$U$89, SMALL(IF($P$3:$P$89=\"○\", ROW($P$3:$P$89)-ROW($P$3)+1), ROW(A51)), COLUMNS($Q$3:Q53)), \"\")","v":""},{"$f":"IFERROR(INDEX($Q$3:$U$89, SMALL(IF($P$3:$P$89=\"○\", ROW($P$3:$P$89)-ROW($P$3)+1), ROW(B51)), COLUMNS($Q$3:R53)), \"\")","v":""},{"$f":"IFERROR(INDEX($Q$3:$U$89, SMALL(IF($P$3:$P$89=\"○\", ROW($P$3:$P$89)-ROW($P$3)+1), ROW(C51)), COLUMNS($Q$3:S53)), \"\")","v":""},{"$f":"IFERROR(INDEX($Q$3:$U$89, SMALL(IF($P$3:$P$89=\"○\", ROW($P$3:$P$89)-ROW($P$3)+1), ROW(D51)), COLUMNS($Q$3:T53)), \"\")","v":""},{"$f":"IFERROR(INDEX($Q$3:$U$89, SMALL(IF($P$3:$P$89=\"○\", ROW($P$3:$P$89)-ROW($P$3)+1), ROW(E51)), COLUMNS($Q$3:U53)), \"\")","v":""}]
[null,null,null,null,null,null,null,null,null,null,null,null,null,null,null,null,{"$f":"IFERROR(INDEX($Q$3:$U$89, SMALL(IF($P$3:$P$89=\"○\", ROW($P$3:$P$89)-ROW($P$3)+1), ROW(A52)), COLUMNS($Q$3:Q54)), \"\")","v":""},{"$f":"IFERROR(INDEX($Q$3:$U$89, SMALL(IF($P$3:$P$89=\"○\", ROW($P$3:$P$89)-ROW($P$3)+1), ROW(B52)), COLUMNS($Q$3:R54)), \"\")","v":""},{"$f":"IFERROR(INDEX($Q$3:$U$89, SMALL(IF($P$3:$P$89=\"○\", ROW($P$3:$P$89)-ROW($P$3)+1), ROW(C52)), COLUMNS($Q$3:S54)), \"\")","v":""},{"$f":"IFERROR(INDEX($Q$3:$U$89, SMALL(IF($P$3:$P$89=\"○\", ROW($P$3:$P$89)-ROW($P$3)+1), ROW(D52)), COLUMNS($Q$3:T54)), \"\")","v":""},{"$f":"IFERROR(INDEX($Q$3:$U$89, SMALL(IF($P$3:$P$89=\"○\", ROW($P$3:$P$89)-ROW($P$3)+1), ROW(E52)), COLUMNS($Q$3:U54)), \"\")","v":""}]
[null,null,null,null,null,null,null,null,null,null,null,null,null,null,null,null,{"$f":"IFERROR(INDEX($Q$3:$U$89, SMALL(IF($P$3:$P$89=\"○\", ROW($P$3:$P$89)-ROW($P$3)+1), ROW(A53)), COLUMNS($Q$3:Q55)), \"\")","v":""},{"$f":"IFERROR(INDEX($Q$3:$U$89, SMALL(IF($P$3:$P$89=\"○\", ROW($P$3:$P$89)-ROW($P$3)+1), ROW(B53)), COLUMNS($Q$3:R55)), \"\")","v":""},{"$f":"IFERROR(INDEX($Q$3:$U$89, SMALL(IF($P$3:$P$89=\"○\", ROW($P$3:$P$89)-ROW($P$3)+1), ROW(C53)), COLUMNS($Q$3:S55)), \"\")","v":""},{"$f":"IFERROR(INDEX($Q$3:$U$89, SMALL(IF($P$3:$P$89=\"○\", ROW($P$3:$P$89)-ROW($P$3)+1), ROW(D53)), COLUMNS($Q$3:T55)), \"\")","v":""},{"$f":"IFERROR(INDEX($Q$3:$U$89, SMALL(IF($P$3:$P$89=\"○\", ROW($P$3:$P$89)-ROW($P$3)+1), ROW(E53)), COLUMNS($Q$3:U55)), \"\")","v":""}]
[null,null,null,null,null,null,null,null,null,null,null,null,null,null,null,null,{"$f":"IFERROR(INDEX($Q$3:$U$89, SMALL(IF($P$3:$P$89=\"○\", ROW($P$3:$P$89)-ROW($P$3)+1), ROW(A54)), COLUMNS($Q$3:Q56)), \"\")","v":""},{"$f":"IFERROR(INDEX($Q$3:$U$89, SMALL(IF($P$3:$P$89=\"○\", ROW($P$3:$P$89)-ROW($P$3)+1), ROW(B54)), COLUMNS($Q$3:R56)), \"\")","v":""},{"$f":"IFERROR(INDEX($Q$3:$U$89, SMALL(IF($P$3:$P$89=\"○\", ROW($P$3:$P$89)-ROW($P$3)+1), ROW(C54)), COLUMNS($Q$3:S56)), \"\")","v":""},{"$f":"IFERROR(INDEX($Q$3:$U$89, SMALL(IF($P$3:$P$89=\"○\", ROW($P$3:$P$89)-ROW($P$3)+1), ROW(D54)), COLUMNS($Q$3:T56)), \"\")","v":""},{"$f":"IFERROR(INDEX($Q$3:$U$89, SMALL(IF($P$3:$P$89=\"○\", ROW($P$3:$P$89)-ROW($P$3)+1), ROW(E54)), COLUMNS($Q$3:U56)), \"\")","v":""}]
[null,null,null,null,null,null,null,null,null,null,null,null,null,null,null,null,{"$f":"IFERROR(INDEX($Q$3:$U$89, SMALL(IF($P$3:$P$89=\"○\", ROW($P$3:$P$89)-ROW($P$3)+1), ROW(A55)), COLUMNS($Q$3:Q57)), \"\")","v":""},{"$f":"IFERROR(INDEX($Q$3:$U$89, SMALL(IF($P$3:$P$89=\"○\", ROW($P$3:$P$89)-ROW($P$3)+1), ROW(B55)), COLUMNS($Q$3:R57)), \"\")","v":""},{"$f":"IFERROR(INDEX($Q$3:$U$89, SMALL(IF($P$3:$P$89=\"○\", ROW($P$3:$P$89)-ROW($P$3)+1), ROW(C55)), COLUMNS($Q$3:S57)), \"\")","v":""},{"$f":"IFERROR(INDEX($Q$3:$U$89, SMALL(IF($P$3:$P$89=\"○\", ROW($P$3:$P$89)-ROW($P$3)+1), ROW(D55)), COLUMNS($Q$3:T57)), \"\")","v":""},{"$f":"IFERROR(INDEX($Q$3:$U$89, SMALL(IF($P$3:$P$89=\"○\", ROW($P$3:$P$89)-ROW($P$3)+1), ROW(E55)), COLUMNS($Q$3:U57)), \"\")","v":""}]
[null,null,null,null,null,null,null,null,null,null,null,null,null,null,null,null,{"$f":"IFERROR(INDEX($Q$3:$U$89, SMALL(IF($P$3:$P$89=\"○\", ROW($P$3:$P$89)-ROW($P$3)+1), ROW(A56)), COLUMNS($Q$3:Q58)), \"\")","v":""},{"$f":"IFERROR(INDEX($Q$3:$U$89, SMALL(IF($P$3:$P$89=\"○\", ROW($P$3:$P$89)-ROW($P$3)+1), ROW(B56)), COLUMNS($Q$3:R58)), \"\")","v":""},{"$f":"IFERROR(INDEX($Q$3:$U$89, SMALL(IF($P$3:$P$89=\"○\", ROW($P$3:$P$89)-ROW($P$3)+1), ROW(C56)), COLUMNS($Q$3:S58)), \"\")","v":""},{"$f":"IFERROR(INDEX($Q$3:$U$89, SMALL(IF($P$3:$P$89=\"○\", ROW($P$3:$P$89)-ROW($P$3)+1), ROW(D56)), COLUMNS($Q$3:T58)), \"\")","v":""},{"$f":"IFERROR(INDEX($Q$3:$U$89, SMALL(IF($P$3:$P$89=\"○\", ROW($P$3:$P$89)-ROW($P$3)+1), ROW(E56)), COLUMNS($Q$3:U58)), \"\")","v":""}]
[null,null,null,null,null,null,null,null,null,null,null,null,null,null,null,null,{"$f":"IFERROR(INDEX($Q$3:$U$89, SMALL(IF($P$3:$P$89=\"○\", ROW($P$3:$P$89)-ROW($P$3)+1), ROW(A57)), COLUMNS($Q$3:Q59)), \"\")","v":""},{"$f":"IFERROR(INDEX($Q$3:$U$89, SMALL(IF($P$3:$P$89=\"○\", ROW($P$3:$P$89)-ROW($P$3)+1), ROW(B57)), COLUMNS($Q$3:R59)), \"\")","v":""},{"$f":"IFERROR(INDEX($Q$3:$U$89, SMALL(IF($P$3:$P$89=\"○\", ROW($P$3:$P$89)-ROW($P$3)+1), ROW(C57)), COLUMNS($Q$3:S59)), \"\")","v":""},{"$f":"IFERROR(INDEX($Q$3:$U$89, SMALL(IF($P$3:$P$89=\"○\", ROW($P$3:$P$89)-ROW($P$3)+1), ROW(D57)), COLUMNS($Q$3:T59)), \"\")","v":""},{"$f":"IFERROR(INDEX($Q$3:$U$89, SMALL(IF($P$3:$P$89=\"○\", ROW($P$3:$P$89)-ROW($P$3)+1), ROW(E57)), COLUMNS($Q$3:U59)), \"\")","v":""}]
[null,null,null,null,null,null,null,null,null,null,null,null,null,null,null,null,{"$f":"IFERROR(INDEX($Q$3:$U$89, SMALL(IF($P$3:$P$89=\"○\", ROW($P$3:$P$89)-ROW($P$3)+1), ROW(A58)), COLUMNS($Q$3:Q60)), \"\")","v":""},{"$f":"IFERROR(INDEX($Q$3:$U$89, SMALL(IF($P$3:$P$89=\"○\", ROW($P$3:$P$89)-ROW($P$3)+1), ROW(B58)), COLUMNS($Q$3:R60)), \"\")","v":""},{"$f":"IFERROR(INDEX($Q$3:$U$89, SMALL(IF($P$3:$P$89=\"○\", ROW($P$3:$P$89)-ROW($P$3)+1), ROW(C58)), COLUMNS($Q$3:S60)), \"\")","v":""},{"$f":"IFERROR(INDEX($Q$3:$U$89, SMALL(IF($P$3:$P$89=\"○\", ROW($P$3:$P$89)-ROW($P$3)+1), ROW(D58)), COLUMNS($Q$3:T60)), \"\")","v":""},{"$f":"IFERROR(INDEX($Q$3:$U$89, SMALL(IF($P$3:$P$89=\"○\", ROW($P$3:$P$89)-ROW($P$3)+1), ROW(E58)), COLUMNS($Q$3:U60)), \"\")","v":""}]
[null,null,null,null,null,null,null,null,null,null,null,null,null,null,null,null,{"$f":"IFERROR(INDEX($Q$3:$U$89, SMALL(IF($P$3:$P$89=\"○\", ROW($P$3:$P$89)-ROW($P$3)+1), ROW(A59)), COLUMNS($Q$3:Q61)), \"\")","v":""},{"$f":"IFERROR(INDEX($Q$3:$U$89, SMALL(IF($P$3:$P$89=\"○\", ROW($P$3:$P$89)-ROW($P$3)+1), ROW(B59)), COLUMNS($Q$3:R61)), \"\")","v":""},{"$f":"IFERROR(INDEX($Q$3:$U$89, SMALL(IF($P$3:$P$89=\"○\", ROW($P$3:$P$89)-ROW($P$3)+1), ROW(C59)), COLUMNS($Q$3:S61)), \"\")","v":""},{"$f":"IFERROR(INDEX($Q$3:$U$89, SMALL(IF($P$3:$P$89=\"○\", ROW($P$3:$P$89)-ROW($P$3)+1), ROW(D59)), COLUMNS($Q$3:T61)), \"\")","v":""},{"$f":"IFERROR(INDEX($Q$3:$U$89, SMALL(IF($P$3:$P$89=\"○\", ROW($P$3:$P$89)-ROW($P$3)+1), ROW(E59)), COLUMNS($Q$3:U61)), \"\")","v":""}]
[null,null,null,null,null,null,null,null,null,null,null,null,null,null,null,null,{"$f":"IFERROR(INDEX($Q$3:$U$89, SMALL(IF($P$3:$P$89=\"○\", ROW($P$3:$P$89)-ROW($P$3)+1), ROW(A60)), COLUMNS($Q$3:Q62)), \"\")","v":""},{"$f":"IFERROR(INDEX($Q$3:$U$89, SMALL(IF($P$3:$P$89=\"○\", ROW($P$3:$P$89)-ROW($P$3)+1), ROW(B60)), COLUMNS($Q$3:R62)), \"\")","v":""},{"$f":"IFERROR(INDEX($Q$3:$U$89, SMALL(IF($P$3:$P$89=\"○\", ROW($P$3:$P$89)-ROW($P$3)+1), ROW(C60)), COLUMNS($Q$3:S62)), \"\")","v":""},{"$f":"IFERROR(INDEX($Q$3:$U$89, SMALL(IF($P$3:$P$89=\"○\", ROW($P$3:$P$89)-ROW($P$3)+1), ROW(D60)), COLUMNS($Q$3:T62)), \"\")","v":""},{"$f":"IFERROR(INDEX($Q$3:$U$89, SMALL(IF($P$3:$P$89=\"○\", ROW($P$3:$P$89)-ROW($P$3)+1), ROW(E60)), COLUMNS($Q$3:U62)), \"\")","v":""}]
[null,null,null,null,null,null,null,null,null,null,null,null,null,null,null,null,{"$f":"IFERROR(INDEX($Q$3:$U$89, SMALL(IF($P$3:$P$89=\"○\", ROW($P$3:$P$89)-ROW($P$3)+1), ROW(A61)), COLUMNS($Q$3:Q63)), \"\")","v":""},{"$f":"IFERROR(INDEX($Q$3:$U$89, SMALL(IF($P$3:$P$89=\"○\", ROW($P$3:$P$89)-ROW($P$3)+1), ROW(B61)), COLUMNS($Q$3:R63)), \"\")","v":""},{"$f":"IFERROR(INDEX($Q$3:$U$89, SMALL(IF($P$3:$P$89=\"○\", ROW($P$3:$P$89)-ROW($P$3)+1), ROW(C61)), COLUMNS($Q$3:S63)), \"\")","v":""},{"$f":"IFERROR(INDEX($Q$3:$U$89, SMALL(IF($P$3:$P$89=\"○\", ROW($P$3:$P$89)-ROW($P$3)+1), ROW(D61)), COLUMNS($Q$3:T63)), \"\")","v":""},{"$f":"IFERROR(INDEX($Q$3:$U$89, SMALL(IF($P$3:$P$89=\"○\", ROW($P$3:$P$89)-ROW($P$3)+1), ROW(E61)), COLUMNS($Q$3:U63)), \"\")","v":""}]
[null,null,null,null,null,null,null,null,null,null,null,null,null,null,null,null,{"$f":"IFERROR(INDEX($Q$3:$U$89, SMALL(IF($P$3:$P$89=\"○\", ROW($P$3:$P$89)-ROW($P$3)+1), ROW(A62)), COLUMNS($Q$3:Q64)), \"\")","v":""},{"$f":"IFERROR(INDEX($Q$3:$U$89, SMALL(IF($P$3:$P$89=\"○\", ROW($P$3:$P$89)-ROW($P$3)+1), ROW(B62)), COLUMNS($Q$3:R64)), \"\")","v":""},{"$f":"IFERROR(INDEX($Q$3:$U$89, SMALL(IF($P$3:$P$89=\"○\", ROW($P$3:$P$89)-ROW($P$3)+1), ROW(C62)), COLUMNS($Q$3:S64)), \"\")","v":""},{"$f":"IFERROR(INDEX($Q$3:$U$89, SMALL(IF($P$3:$P$89=\"○\", ROW($P$3:$P$89)-ROW($P$3)+1), ROW(D62)), COLUMNS($Q$3:T64)), \"\")","v":""},{"$f":"IFERROR(INDEX($Q$3:$U$89, SMALL(IF($P$3:$P$89=\"○\", ROW($P$3:$P$89)-ROW($P$3)+1), ROW(E62)), COLUMNS($Q$3:U64)), \"\")","v":""}]
[null,null,null,null,null,null,null,null,null,null,null,null,null,null,null,null,{"$f":"IFERROR(INDEX($Q$3:$U$89, SMALL(IF($P$3:$P$89=\"○\", ROW($P$3:$P$89)-ROW($P$3)+1), ROW(A63)), COLUMNS($Q$3:Q65)), \"\")","v":""},{"$f":"IFERROR(INDEX($Q$3:$U$89, SMALL(IF($P$3:$P$89=\"○\", ROW($P$3:$P$89)-ROW($P$3)+1), ROW(B63)), COLUMNS($Q$3:R65)), \"\")","v":""},{"$f":"IFERROR(INDEX($Q$3:$U$89, SMALL(IF($P$3:$P$89=\"○\", ROW($P$3:$P$89)-ROW($P$3)+1), ROW(C63)), COLUMNS($Q$3:S65)), \"\")","v":""},{"$f":"IFERROR(INDEX($Q$3:$U$89, SMALL(IF($P$3:$P$89=\"○\", ROW($P$3:$P$89)-ROW($P$3)+1), ROW(D63)), COLUMNS($Q$3:T65)), \"\")","v":""},{"$f":"IFERROR(INDEX($Q$3:$U$89, SMALL(IF($P$3:$P$89=\"○\", ROW($P$3:$P$89)-ROW($P$3)+1), ROW(E63)), COLUMNS($Q$3:U65)), \"\")","v":""}]
[null,null,null,null,null,null,null,null,null,null,null,null,null,null,null,null,{"$f":"IFERROR(INDEX($Q$3:$U$89, SMALL(IF($P$3:$P$89=\"○\", ROW($P$3:$P$89)-ROW($P$3)+1), ROW(A64)), COLUMNS($Q$3:Q66)), \"\")","v":""},{"$f":"IFERROR(INDEX($Q$3:$U$89, SMALL(IF($P$3:$P$89=\"○\", ROW($P$3:$P$89)-ROW($P$3)+1), ROW(B64)), COLUMNS($Q$3:R66)), \"\")","v":""},{"$f":"IFERROR(INDEX($Q$3:$U$89, SMALL(IF($P$3:$P$89=\"○\", ROW($P$3:$P$89)-ROW($P$3)+1), ROW(C64)), COLUMNS($Q$3:S66)), \"\")","v":""},{"$f":"IFERROR(INDEX($Q$3:$U$89, SMALL(IF($P$3:$P$89=\"○\", ROW($P$3:$P$89)-ROW($P$3)+1), ROW(D64)), COLUMNS($Q$3:T66)), \"\")","v":""},{"$f":"IFERROR(INDEX($Q$3:$U$89, SMALL(IF($P$3:$P$89=\"○\", ROW($P$3:$P$89)-ROW($P$3)+1), ROW(E64)), COLUMNS($Q$3:U66)), \"\")","v":""}]
[null,null,null,null,null,null,null,null,null,null,null,null,null,null,null,null,{"$f":"IFERROR(INDEX($Q$3:$U$89, SMALL(IF($P$3:$P$89=\"○\", ROW($P$3:$P$89)-ROW($P$3)+1), ROW(A65)), COLUMNS($Q$3:Q67)), \"\")","v":""},{"$f":"IFERROR(INDEX($Q$3:$U$89, SMALL(IF($P$3:$P$89=\"○\", ROW($P$3:$P$89)-ROW($P$3)+1), ROW(B65)), COLUMNS($Q$3:R67)), \"\")","v":""},{"$f":"IFERROR(INDEX($Q$3:$U$89, SMALL(IF($P$3:$P$89=\"○\", ROW($P$3:$P$89)-ROW($P$3)+1), ROW(C65)), COLUMNS($Q$3:S67)), \"\")","v":""},{"$f":"IFERROR(INDEX($Q$3:$U$89, SMALL(IF($P$3:$P$89=\"○\", ROW($P$3:$P$89)-ROW($P$3)+1), ROW(D65)), COLUMNS($Q$3:T67)), \"\")","v":""},{"$f":"IFERROR(INDEX($Q$3:$U$89, SMALL(IF($P$3:$P$89=\"○\", ROW($P$3:$P$89)-ROW($P$3)+1), ROW(E65)), COLUMNS($Q$3:U67)), \"\")","v":""}]
[null,null,null,null,null,null,null,null,null,null,null,null,null,null,null,null,{"$f":"IFERROR(INDEX($Q$3:$U$89, SMALL(IF($P$3:$P$89=\"○\", ROW($P$3:$P$89)-ROW($P$3)+1), ROW(A66)), COLUMNS($Q$3:Q68)), \"\")","v":""},{"$f":"IFERROR(INDEX($Q$3:$U$89, SMALL(IF($P$3:$P$89=\"○\", ROW($P$3:$P$89)-ROW($P$3)+1), ROW(B66)), COLUMNS($Q$3:R68)), \"\")","v":""},{"$f":"IFERROR(INDEX($Q$3:$U$89, SMALL(IF($P$3:$P$89=\"○\", ROW($P$3:$P$89)-ROW($P$3)+1), ROW(C66)), COLUMNS($Q$3:S68)), \"\")","v":""},{"$f":"IFERROR(INDEX($Q$3:$U$89, SMALL(IF($P$3:$P$89=\"○\", ROW($P$3:$P$89)-ROW($P$3)+1), ROW(D66)), COLUMNS($Q$3:T68)), \"\")","v":""},{"$f":"IFERROR(INDEX($Q$3:$U$89, SMALL(IF($P$3:$P$89=\"○\", ROW($P$3:$P$89)-ROW($P$3)+1), ROW(E66)), COLUMNS($Q$3:U68)), \"\")","v":""}]
[null,null,null,null,null,null,null,null,null,null,null,null,null,null,null,null,{"$f":"IFERROR(INDEX($Q$3:$U$89, SMALL(IF($P$3:$P$89=\"○\", ROW($P$3:$P$89)-ROW($P$3)+1), ROW(A67)), COLUMNS($Q$3:Q69)), \"\")","v":""},{"$f":"IFERROR(INDEX($Q$3:$U$89, SMALL(IF($P$3:$P$89=\"○\", ROW($P$3:$P$89)-ROW($P$3)+1), ROW(B67)), COLUMNS($Q$3:R69)), \"\")","v":""},{"$f":"IFERROR(INDEX($Q$3:$U$89, SMALL(IF($P$3:$P$89=\"○\", ROW($P$3:$P$89)-ROW($P$3)+1), ROW(C67)), COLUMNS($Q$3:S69)), \"\")","v":""},{"$f":"IFERROR(INDEX($Q$3:$U$89, SMALL(IF($P$3:$P$89=\"○\", ROW($P$3:$P$89)-ROW($P$3)+1), ROW(D67)), COLUMNS($Q$3:T69)), \"\")","v":""},{"$f":"IFERROR(INDEX($Q$3:$U$89, SMALL(IF($P$3:$P$89=\"○\", ROW($P$3:$P$89)-ROW($P$3)+1), ROW(E67)), COLUMNS($Q$3:U69)), \"\")","v":""}]
[null,null,null,null,null,null,null,null,null,null,null,null,null,null,null,null,{"$f":"IFERROR(INDEX($Q$3:$U$89, SMALL(IF($P$3:$P$89=\"○\", ROW($P$3:$P$89)-ROW($P$3)+1), ROW(A68)), COLUMNS($Q$3:Q70)), \"\")","v":""},{"$f":"IFERROR(INDEX($Q$3:$U$89, SMALL(IF($P$3:$P$89=\"○\", ROW($P$3:$P$89)-ROW($P$3)+1), ROW(B68)), COLUMNS($Q$3:R70)), \"\")","v":""},{"$f":"IFERROR(INDEX($Q$3:$U$89, SMALL(IF($P$3:$P$89=\"○\", ROW($P$3:$P$89)-ROW($P$3)+1), ROW(C68)), COLUMNS($Q$3:S70)), \"\")","v":""},{"$f":"IFERROR(INDEX($Q$3:$U$89, SMALL(IF($P$3:$P$89=\"○\", ROW($P$3:$P$89)-ROW($P$3)+1), ROW(D68)), COLUMNS($Q$3:T70)), \"\")","v":""},{"$f":"IFERROR(INDEX($Q$3:$U$89, SMALL(IF($P$3:$P$89=\"○\", ROW($P$3:$P$89)-ROW($P$3)+1), ROW(E68)), COLUMNS($Q$3:U70)), \"\")","v":""}]
[null,null,null,null,null,null,null,null,null,null,null,null,null,null,null,null,{"$f":"IFERROR(INDEX($Q$3:$U$89, SMALL(IF($P$3:$P$89=\"○\", ROW($P$3:$P$89)-ROW($P$3)+1), ROW(A69)), COLUMNS($Q$3:Q71)), \"\")","v":""},{"$f":"IFERROR(INDEX($Q$3:$U$89, SMALL(IF($P$3:$P$89=\"○\", ROW($P$3:$P$89)-ROW($P$3)+1), ROW(B69)), COLUMNS($Q$3:R71)), \"\")","v":""},{"$f":"IFERROR(INDEX($Q$3:$U$89, SMALL(IF($P$3:$P$89=\"○\", ROW($P$3:$P$89)-ROW($P$3)+1), ROW(C69)), COLUMNS($Q$3:S71)), \"\")","v":""},{"$f":"IFERROR(INDEX($Q$3:$U$89, SMALL(IF($P$3:$P$89=\"○\", ROW($P$3:$P$89)-ROW($P$3)+1), ROW(D69)), COLUMNS($Q$3:T71)), \"\")","v":""},{"$f":"IFERROR(INDEX($Q$3:$U$89, SMALL(IF($P$3:$P$89=\"○\", ROW($P$3:$P$89)-ROW($P$3)+1), ROW(E69)), COLUMNS($Q$3:U71)), \"\")","v":""}]
[null,null,null,null,null,null,null,null,null,null,null,null,null,null,null,null,{"$f":"IFERROR(INDEX($Q$3:$U$89, SMALL(IF($P$3:$P$89=\"○\", ROW($P$3:$P$89)-ROW($P$3)+1), ROW(A70)), COLUMNS($Q$3:Q72)), \"\")","v":""},{"$f":"IFERROR(INDEX($Q$3:$U$89, SMALL(IF($P$3:$P$89=\"○\", ROW($P$3:$P$89)-ROW($P$3)+1), ROW(B70)), COLUMNS($Q$3:R72)), \"\")","v":""},{"$f":"IFERROR(INDEX($Q$3:$U$89, SMALL(IF($P$3:$P$89=\"○\", ROW($P$3:$P$89)-ROW($P$3)+1), ROW(C70)), COLUMNS($Q$3:S72)), \"\")","v":""},{"$f":"IFERROR(INDEX($Q$3:$U$89, SMALL(IF($P$3:$P$89=\"○\", ROW($P$3:$P$89)-ROW($P$3)+1), ROW(D70)), COLUMNS($Q$3:T72)), \"\")","v":""},{"$f":"IFERROR(INDEX($Q$3:$U$89, SMALL(IF($P$3:$P$89=\"○\", ROW($P$3:$P$89)-ROW($P$3)+1), ROW(E70)), COLUMNS($Q$3:U72)), \"\")","v":""}]
[null,null,null,null,null,null,null,null,null,null,null,null,null,null,null,null,{"$f":"IFERROR(INDEX($Q$3:$U$89, SMALL(IF($P$3:$P$89=\"○\", ROW($P$3:$P$89)-ROW($P$3)+1), ROW(A71)), COLUMNS($Q$3:Q73)), \"\")","v":""},{"$f":"IFERROR(INDEX($Q$3:$U$89, SMALL(IF($P$3:$P$89=\"○\", ROW($P$3:$P$89)-ROW($P$3)+1), ROW(B71)), COLUMNS($Q$3:R73)), \"\")","v":""},{"$f":"IFERROR(INDEX($Q$3:$U$89, SMALL(IF($P$3:$P$89=\"○\", ROW($P$3:$P$89)-ROW($P$3)+1), ROW(C71)), COLUMNS($Q$3:S73)), \"\")","v":""},{"$f":"IFERROR(INDEX($Q$3:$U$89, SMALL(IF($P$3:$P$89=\"○\", ROW($P$3:$P$89)-ROW($P$3)+1), ROW(D71)), COLUMNS($Q$3:T73)), \"\")","v":""},{"$f":"IFERROR(INDEX($Q$3:$U$89, SMALL(IF($P$3:$P$89=\"○\", ROW($P$3:$P$89)-ROW($P$3)+1), ROW(E71)), COLUMNS($Q$3:U73)), \"\")","v":""}]
[null,null,null,null,null,null,null,null,null,null,null,null,null,null,null,null,{"$f":"IFERROR(INDEX($Q$3:$U$89, SMALL(IF($P$3:$P$89=\"○\", ROW($P$3:$P$89)-ROW($P$3)+1), ROW(A72)), COLUMNS($Q$3:Q74)), \"\")","v":""},{"$f":"IFERROR(INDEX($Q$3:$U$89, SMALL(IF($P$3:$P$89=\"○\", ROW($P$3:$P$89)-ROW($P$3)+1), ROW(B72)), COLUMNS($Q$3:R74)), \"\")","v":""},{"$f":"IFERROR(INDEX($Q$3:$U$89, SMALL(IF($P$3:$P$89=\"○\", ROW($P$3:$P$89)-ROW($P$3)+1), ROW(C72)), COLUMNS($Q$3:S74)), \"\")","v":""},{"$f":"IFERROR(INDEX($Q$3:$U$89, SMALL(IF($P$3:$P$89=\"○\", ROW($P$3:$P$89)-ROW($P$3)+1), ROW(D72)), COLUMNS($Q$3:T74)), \"\")","v":""},{"$f":"IFERROR(INDEX($Q$3:$U$89, SMALL(IF($P$3:$P$89=\"○\", ROW($P$3:$P$89)-ROW($P$3)+1), ROW(E72)), COLUMNS($Q$3:U74)), \"\")","v":""}]
[null,null,null,null,null,null,null,null,null,null,null,null,null,null,null,null,{"$f":"IFERROR(INDEX($Q$3:$U$89, SMALL(IF($P$3:$P$89=\"○\", ROW($P$3:$P$89)-ROW($P$3)+1), ROW(A73)), COLUMNS($Q$3:Q75)), \"\")","v":""},{"$f":"IFERROR(INDEX($Q$3:$U$89, SMALL(IF($P$3:$P$89=\"○\", ROW($P$3:$P$89)-ROW($P$3)+1), ROW(B73)), COLUMNS($Q$3:R75)), \"\")","v":""},{"$f":"IFERROR(INDEX($Q$3:$U$89, SMALL(IF($P$3:$P$89=\"○\", ROW($P$3:$P$89)-ROW($P$3)+1), ROW(C73)), COLUMNS($Q$3:S75)), \"\")","v":""},{"$f":"IFERROR(INDEX($Q$3:$U$89, SMALL(IF($P$3:$P$89=\"○\", ROW($P$3:$P$89)-ROW($P$3)+1), ROW(D73)), COLUMNS($Q$3:T75)), \"\")","v":""},{"$f":"IFERROR(INDEX($Q$3:$U$89, SMALL(IF($P$3:$P$89=\"○\", ROW($P$3:$P$89)-ROW($P$3)+1), ROW(E73)), COLUMNS($Q$3:U75)), \"\")","v":""}]
[null,null,null,null,null,null,null,null,null,null,null,null,null,null,null,null,{"$f":"IFERROR(INDEX($Q$3:$U$89, SMALL(IF($P$3:$P$89=\"○\", ROW($P$3:$P$89)-ROW($P$3)+1), ROW(A74)), COLUMNS($Q$3:Q76)), \"\")","v":""},{"$f":"IFERROR(INDEX($Q$3:$U$89, SMALL(IF($P$3:$P$89=\"○\", ROW($P$3:$P$89)-ROW($P$3)+1), ROW(B74)), COLUMNS($Q$3:R76)), \"\")","v":""},{"$f":"IFERROR(INDEX($Q$3:$U$89, SMALL(IF($P$3:$P$89=\"○\", ROW($P$3:$P$89)-ROW($P$3)+1), ROW(C74)), COLUMNS($Q$3:S76)), \"\")","v":""},{"$f":"IFERROR(INDEX($Q$3:$U$89, SMALL(IF($P$3:$P$89=\"○\", ROW($P$3:$P$89)-ROW($P$3)+1), ROW(D74)), COLUMNS($Q$3:T76)), \"\")","v":""},{"$f":"IFERROR(INDEX($Q$3:$U$89, SMALL(IF($P$3:$P$89=\"○\", ROW($P$3:$P$89)-ROW($P$3)+1), ROW(E74)), COLUMNS($Q$3:U76)), \"\")","v":""}]
[null,null,null,null,null,null,null,null,null,null,null,null,null,null,null,null,{"$f":"IFERROR(INDEX($Q$3:$U$89, SMALL(IF($P$3:$P$89=\"○\", ROW($P$3:$P$89)-ROW($P$3)+1), ROW(A75)), COLUMNS($Q$3:Q77)), \"\")","v":""},{"$f":"IFERROR(INDEX($Q$3:$U$89, SMALL(IF($P$3:$P$89=\"○\", ROW($P$3:$P$89)-ROW($P$3)+1), ROW(B75)), COLUMNS($Q$3:R77)), \"\")","v":""},{"$f":"IFERROR(INDEX($Q$3:$U$89, SMALL(IF($P$3:$P$89=\"○\", ROW($P$3:$P$89)-ROW($P$3)+1), ROW(C75)), COLUMNS($Q$3:S77)), \"\")","v":""},{"$f":"IFERROR(INDEX($Q$3:$U$89, SMALL(IF($P$3:$P$89=\"○\", ROW($P$3:$P$89)-ROW($P$3)+1), ROW(D75)), COLUMNS($Q$3:T77)), \"\")","v":""},{"$f":"IFERROR(INDEX($Q$3:$U$89, SMALL(IF($P$3:$P$89=\"○\", ROW($P$3:$P$89)-ROW($P$3)+1), ROW(E75)), COLUMNS($Q$3:U77)), \"\")","v":""}]
[null,null,null,null,null,null,null,null,null,null,null,null,null,null,null,null,{"$f":"IFERROR(INDEX($Q$3:$U$89, SMALL(IF($P$3:$P$89=\"○\", ROW($P$3:$P$89)-ROW($P$3)+1), ROW(A76)), COLUMNS($Q$3:Q78)), \"\")","v":""},{"$f":"IFERROR(INDEX($Q$3:$U$89, SMALL(IF($P$3:$P$89=\"○\", ROW($P$3:$P$89)-ROW($P$3)+1), ROW(B76)), COLUMNS($Q$3:R78)), \"\")","v":""},{"$f":"IFERROR(INDEX($Q$3:$U$89, SMALL(IF($P$3:$P$89=\"○\", ROW($P$3:$P$89)-ROW($P$3)+1), ROW(C76)), COLUMNS($Q$3:S78)), \"\")","v":""},{"$f":"IFERROR(INDEX($Q$3:$U$89, SMALL(IF($P$3:$P$89=\"○\", ROW($P$3:$P$89)-ROW($P$3)+1), ROW(D76)), COLUMNS($Q$3:T78)), \"\")","v":""},{"$f":"IFERROR(INDEX($Q$3:$U$89, SMALL(IF($P$3:$P$89=\"○\", ROW($P$3:$P$89)-ROW($P$3)+1), ROW(E76)), COLUMNS($Q$3:U78)), \"\")","v":""}]
[null,null,null,null,null,null,null,null,null,null,null,null,null,null,null,null,{"$f":"IFERROR(INDEX($Q$3:$U$89, SMALL(IF($P$3:$P$89=\"○\", ROW($P$3:$P$89)-ROW($P$3)+1), ROW(A77)), COLUMNS($Q$3:Q79)), \"\")","v":""},{"$f":"IFERROR(INDEX($Q$3:$U$89, SMALL(IF($P$3:$P$89=\"○\", ROW($P$3:$P$89)-ROW($P$3)+1), ROW(B77)), COLUMNS($Q$3:R79)), \"\")","v":""},{"$f":"IFERROR(INDEX($Q$3:$U$89, SMALL(IF($P$3:$P$89=\"○\", ROW($P$3:$P$89)-ROW($P$3)+1), ROW(C77)), COLUMNS($Q$3:S79)), \"\")","v":""},{"$f":"IFERROR(INDEX($Q$3:$U$89, SMALL(IF($P$3:$P$89=\"○\", ROW($P$3:$P$89)-ROW($P$3)+1), ROW(D77)), COLUMNS($Q$3:T79)), \"\")","v":""},{"$f":"IFERROR(INDEX($Q$3:$U$89, SMALL(IF($P$3:$P$89=\"○\", ROW($P$3:$P$89)-ROW($P$3)+1), ROW(E77)), COLUMNS($Q$3:U79)), \"\")","v":""}]
[null,null,null,null,null,null,null,null,null,null,null,null,null,null,null,null,{"$f":"IFERROR(INDEX($Q$3:$U$89, SMALL(IF($P$3:$P$89=\"○\", ROW($P$3:$P$89)-ROW($P$3)+1), ROW(A78)), COLUMNS($Q$3:Q80)), \"\")","v":""},{"$f":"IFERROR(INDEX($Q$3:$U$89, SMALL(IF($P$3:$P$89=\"○\", ROW($P$3:$P$89)-ROW($P$3)+1), ROW(B78)), COLUMNS($Q$3:R80)), \"\")","v":""},{"$f":"IFERROR(INDEX($Q$3:$U$89, SMALL(IF($P$3:$P$89=\"○\", ROW($P$3:$P$89)-ROW($P$3)+1), ROW(C78)), COLUMNS($Q$3:S80)), \"\")","v":""},{"$f":"IFERROR(INDEX($Q$3:$U$89, SMALL(IF($P$3:$P$89=\"○\", ROW($P$3:$P$89)-ROW($P$3)+1), ROW(D78)), COLUMNS($Q$3:T80)), \"\")","v":""},{"$f":"IFERROR(INDEX($Q$3:$U$89, SMALL(IF($P$3:$P$89=\"○\", ROW($P$3:$P$89)-ROW($P$3)+1), ROW(E78)), COLUMNS($Q$3:U80)), \"\")","v":""}]
[null,null,null,null,null,null,null,null,null,null,null,null,null,null,null,null,{"$f":"IFERROR(INDEX($Q$3:$U$89, SMALL(IF($P$3:$P$89=\"○\", ROW($P$3:$P$89)-ROW($P$3)+1), ROW(A79)), COLUMNS($Q$3:Q81)), \"\")","v":""},{"$f":"IFERROR(INDEX($Q$3:$U$89, SMALL(IF($P$3:$P$89=\"○\", ROW($P$3:$P$89)-ROW($P$3)+1), ROW(B79)), COLUMNS($Q$3:R81)), \"\")","v":""},{"$f":"IFERROR(INDEX($Q$3:$U$89, SMALL(IF($P$3:$P$89=\"○\", ROW($P$3:$P$89)-ROW($P$3)+1), ROW(C79)), COLUMNS($Q$3:S81)), \"\")","v":""},{"$f":"IFERROR(INDEX($Q$3:$U$89, SMALL(IF($P$3:$P$89=\"○\", ROW($P$3:$P$89)-ROW($P$3)+1), ROW(D79)), COLUMNS($Q$3:T81)), \"\")","v":""},{"$f":"IFERROR(INDEX($Q$3:$U$89, SMALL(IF($P$3:$P$89=\"○\", ROW($P$3:$P$89)-ROW($P$3)+1), ROW(E79)), COLUMNS($Q$3:U81)), \"\")","v":""}]
[null,null,null,null,null,null,null,null,null,null,null,null,null,null,null,null,{"$f":"IFERROR(INDEX($Q$3:$U$89, SMALL(IF($P$3:$P$89=\"○\", ROW($P$3:$P$89)-ROW($P$3)+1), ROW(A80)), COLUMNS($Q$3:Q82)), \"\")","v":""},{"$f":"IFERROR(INDEX($Q$3:$U$89, SMALL(IF($P$3:$P$89=\"○\", ROW($P$3:$P$89)-ROW($P$3)+1), ROW(B80)), COLUMNS($Q$3:R82)), \"\")","v":""},{"$f":"IFERROR(INDEX($Q$3:$U$89, SMALL(IF($P$3:$P$89=\"○\", ROW($P$3:$P$89)-ROW($P$3)+1), ROW(C80)), COLUMNS($Q$3:S82)), \"\")","v":""},{"$f":"IFERROR(INDEX($Q$3:$U$89, SMALL(IF($P$3:$P$89=\"○\", ROW($P$3:$P$89)-ROW($P$3)+1), ROW(D80)), COLUMNS($Q$3:T82)), \"\")","v":""},{"$f":"IFERROR(INDEX($Q$3:$U$89, SMALL(IF($P$3:$P$89=\"○\", ROW($P$3:$P$89)-ROW($P$3)+1), ROW(E80)), COLUMNS($Q$3:U82)), \"\")","v":""}]
[null,null,null,null,null,null,null,null,null,null,null,null,null,null,null,null,{"$f":"IFERROR(INDEX($Q$3:$U$89, SMALL(IF($P$3:$P$89=\"○\", ROW($P$3:$P$89)-ROW($P$3)+1), ROW(A81)), COLUMNS($Q$3:Q83)), \"\")","v":""},{"$f":"IFERROR(INDEX($Q$3:$U$89, SMALL(IF($P$3:$P$89=\"○\", ROW($P$3:$P$89)-ROW($P$3)+1), ROW(B81)), COLUMNS($Q$3:R83)), \"\")","v":""},{"$f":"IFERROR(INDEX($Q$3:$U$89, SMALL(IF($P$3:$P$89=\"○\", ROW($P$3:$P$89)-ROW($P$3)+1), ROW(C81)), COLUMNS($Q$3:S83)), \"\")","v":""},{"$f":"IFERROR(INDEX($Q$3:$U$89, SMALL(IF($P$3:$P$89=\"○\", ROW($P$3:$P$89)-ROW($P$3)+1), ROW(D81)), COLUMNS($Q$3:T83)), \"\")","v":""},{"$f":"IFERROR(INDEX($Q$3:$U$89, SMALL(IF($P$3:$P$89=\"○\", ROW($P$3:$P$89)-ROW($P$3)+1), ROW(E81)), COLUMNS($Q$3:U83)), \"\")","v":""}]
[null,null,null,null,null,null,null,null,null,null,null,null,null,null,null,null,{"$f":"IFERROR(INDEX($Q$3:$U$89, SMALL(IF($P$3:$P$89=\"○\", ROW($P$3:$P$89)-ROW($P$3)+1), ROW(A82)), COLUMNS($Q$3:Q84)), \"\")","v":""},{"$f":"IFERROR(INDEX($Q$3:$U$89, SMALL(IF($P$3:$P$89=\"○\", ROW($P$3:$P$89)-ROW($P$3)+1), ROW(B82)), COLUMNS($Q$3:R84)), \"\")","v":""},{"$f":"IFERROR(INDEX($Q$3:$U$89, SMALL(IF($P$3:$P$89=\"○\", ROW($P$3:$P$89)-ROW($P$3)+1), ROW(C82)), COLUMNS($Q$3:S84)), \"\")","v":""},{"$f":"IFERROR(INDEX($Q$3:$U$89, SMALL(IF($P$3:$P$89=\"○\", ROW($P$3:$P$89)-ROW($P$3)+1), ROW(D82)), COLUMNS($Q$3:T84)), \"\")","v":""},{"$f":"IFERROR(INDEX($Q$3:$U$89, SMALL(IF($P$3:$P$89=\"○\", ROW($P$3:$P$89)-ROW($P$3)+1), ROW(E82)), COLUMNS($Q$3:U84)), \"\")","v":""}]
[null,null,null,null,null,null,null,null,null,null,null,null,null,null,null,null,{"$f":"IFERROR(INDEX($Q$3:$U$89, SMALL(IF($P$3:$P$89=\"○\", ROW($P$3:$P$89)-ROW($P$3)+1), ROW(A83)), COLUMNS($Q$3:Q85)), \"\")","v":""},{"$f":"IFERROR(INDEX($Q$3:$U$89, SMALL(IF($P$3:$P$89=\"○\", ROW($P$3:$P$89)-ROW($P$3)+1), ROW(B83)), COLUMNS($Q$3:R85)), \"\")","v":""},{"$f":"IFERROR(INDEX($Q$3:$U$89, SMALL(IF($P$3:$P$89=\"○\", ROW($P$3:$P$89)-ROW($P$3)+1), ROW(C83)), COLUMNS($Q$3:S85)), \"\")","v":""},{"$f":"IFERROR(INDEX($Q$3:$U$89, SMALL(IF($P$3:$P$89=\"○\", ROW($P$3:$P$89)-ROW($P$3)+1), ROW(D83)), COLUMNS($Q$3:T85)), \"\")","v":""},{"$f":"IFERROR(INDEX($Q$3:$U$89, SMALL(IF($P$3:$P$89=\"○\", ROW($P$3:$P$89)-ROW($P$3)+1), ROW(E83)), COLUMNS($Q$3:U85)), \"\")","v":""}]
[null,null,null,null,null,null,null,null,null,null,null,null,null,null,null,null,{"$f":"IFERROR(INDEX($Q$3:$U$89, SMALL(IF($P$3:$P$89=\"○\", ROW($P$3:$P$89)-ROW($P$3)+1), ROW(A84)), COLUMNS($Q$3:Q86)), \"\")","v":""},{"$f":"IFERROR(INDEX($Q$3:$U$89, SMALL(IF($P$3:$P$89=\"○\", ROW($P$3:$P$89)-ROW($P$3)+1), ROW(B84)), COLUMNS($Q$3:R86)), \"\")","v":""},{"$f":"IFERROR(INDEX($Q$3:$U$89, SMALL(IF($P$3:$P$89=\"○\", ROW($P$3:$P$89)-ROW($P$3)+1), ROW(C84)), COLUMNS($Q$3:S86)), \"\")","v":""},{"$f":"IFERROR(INDEX($Q$3:$U$89, SMALL(IF($P$3:$P$89=\"○\", ROW($P$3:$P$89)-ROW($P$3)+1), ROW(D84)), COLUMNS($Q$3:T86)), \"\")","v":""},{"$f":"IFERROR(INDEX($Q$3:$U$89, SMALL(IF($P$3:$P$89=\"○\", ROW($P$3:$P$89)-ROW($P$3)+1), ROW(E84)), COLUMNS($Q$3:U86)), \"\")","v":""}]
[null,null,null,null,null,null,null,null,null,null,null,null,null,null,null,null,{"$f":"IFERROR(INDEX($Q$3:$U$89, SMALL(IF($P$3:$P$89=\"○\", ROW($P$3:$P$89)-ROW($P$3)+1), ROW(A85)), COLUMNS($Q$3:Q87)), \"\")","v":""},{"$f":"IFERROR(INDEX($Q$3:$U$89, SMALL(IF($P$3:$P$89=\"○\", ROW($P$3:$P$89)-ROW($P$3)+1), ROW(B85)), COLUMNS($Q$3:R87)), \"\")","v":""},{"$f":"IFERROR(INDEX($Q$3:$U$89, SMALL(IF($P$3:$P$89=\"○\", ROW($P$3:$P$89)-ROW($P$3)+1), ROW(C85)), COLUMNS($Q$3:S87)), \"\")","v":""},{"$f":"IFERROR(INDEX($Q$3:$U$89, SMALL(IF($P$3:$P$89=\"○\", ROW($P$3:$P$89)-ROW($P$3)+1), ROW(D85)), COLUMNS($Q$3:T87)), \"\")","v":""},{"$f":"IFERROR(INDEX($Q$3:$U$89, SMALL(IF($P$3:$P$89=\"○\", ROW($P$3:$P$89)-ROW($P$3)+1), ROW(E85)), COLUMNS($Q$3:U87)), \"\")","v":""}]
[null,null,null,null,null,null,null,null,null,null,null,null,null,null,null,null,{"$f":"IFERROR(INDEX($Q$3:$U$89, SMALL(IF($P$3:$P$89=\"○\", ROW($P$3:$P$89)-ROW($P$3)+1), ROW(A86)), COLUMNS($Q$3:Q88)), \"\")","v":""},{"$f":"IFERROR(INDEX($Q$3:$U$89, SMALL(IF($P$3:$P$89=\"○\", ROW($P$3:$P$89)-ROW($P$3)+1), ROW(B86)), COLUMNS($Q$3:R88)), \"\")","v":""},{"$f":"IFERROR(INDEX($Q$3:$U$89, SMALL(IF($P$3:$P$89=\"○\", ROW($P$3:$P$89)-ROW($P$3)+1), ROW(C86)), COLUMNS($Q$3:S88)), \"\")","v":""},{"$f":"IFERROR(INDEX($Q$3:$U$89, SMALL(IF($P$3:$P$89=\"○\", ROW($P$3:$P$89)-ROW($P$3)+1), ROW(D86)), COLUMNS($Q$3:T88)), \"\")","v":""},{"$f":"IFERROR(INDEX($Q$3:$U$89, SMALL(IF($P$3:$P$89=\"○\", ROW($P$3:$P$89)-ROW($P$3)+1), ROW(E86)), COLUMNS($Q$3:U88)), \"\")","v":""}]
[null,null,null,null,null,null,null,null,null,null,null,null,null,null,null,null,{"$f":"IFERROR(INDEX($Q$3:$U$89, SMALL(IF($P$3:$P$89=\"○\", ROW($P$3:$P$89)-ROW($P$3)+1), ROW(A87)), COLUMNS($Q$3:Q89)), \"\")","v":""},{"$f":"IFERROR(INDEX($Q$3:$U$89, SMALL(IF($P$3:$P$89=\"○\", ROW($P$3:$P$89)-ROW($P$3)+1), ROW(B87)), COLUMNS($Q$3:R89)), \"\")","v":""},{"$f":"IFERROR(INDEX($Q$3:$U$89, SMALL(IF($P$3:$P$89=\"○\", ROW($P$3:$P$89)-ROW($P$3)+1), ROW(C87)), COLUMNS($Q$3:S89)), \"\")","v":""},{"$f":"IFERROR(INDEX($Q$3:$U$89, SMALL(IF($P$3:$P$89=\"○\", ROW($P$3:$P$89)-ROW($P$3)+1), ROW(D87)), COLUMNS($Q$3:T89)), \"\")","v":""},{"$f":"IFERROR(INDEX($Q$3:$U$89, SMALL(IF($P$3:$P$89=\"○\", ROW($P$3:$P$89)-ROW($P$3)+1), ROW(E87)), COLUMNS($Q$3:U89)), \"\")","v":""}]
[null,null,null,null,null,null,null,null,null,null,null,null,null,null,null,null,{"$f":"IFERROR(INDEX($Q$3:$U$89, SMALL(IF($P$3:$P$89=\"○\", ROW($P$3:$P$89)-ROW($P$3)+1), ROW(A88)), COLUMNS($Q$3:Q90)), \"\")","v":""},{"$f":"IFERROR(INDEX($Q$3:$U$89, SMALL(IF($P$3:$P$89=\"○\", ROW($P$3:$P$89)-ROW($P$3)+1), ROW(B88)), COLUMNS($Q$3:R90)), \"\")","v":""},{"$f":"IFERROR(INDEX($Q$3:$U$89, SMALL(IF($P$3:$P$89=\"○\", ROW($P$3:$P$89)-ROW($P$3)+1), ROW(C88)), COLUMNS($Q$3:S90)), \"\")","v":""},{"$f":"IFERROR(INDEX($Q$3:$U$89, SMALL(IF($P$3:$P$89=\"○\", ROW($P$3:$P$89)-ROW($P$3)+1), ROW(D88)), COLUMNS($Q$3:T90)), \"\")","v":""},{"$f":"IFERROR(INDEX($Q$3:$U$89, SMALL(IF($P$3:$P$89=\"○\", ROW($P$3:$P$89)-ROW($P$3)+1), ROW(E88)), COLUMNS($Q$3:U90)), \"\")","v":""}]
[null,null,null,null,null,null,null,null,null,null,null,null,null,null,null,null,{"$f":"IFERROR(INDEX($Q$3:$U$89, SMALL(IF($P$3:$P$89=\"○\", ROW($P$3:$P$89)-ROW($P$3)+1), ROW(A89)), COLUMNS($Q$3:Q91)), \"\")","v":""},{"$f":"IFERROR(INDEX($Q$3:$U$89, SMALL(IF($P$3:$P$89=\"○\", ROW($P$3:$P$89)-ROW($P$3)+1), ROW(B89)), COLUMNS($Q$3:R91)), \"\")","v":""},{"$f":"IFERROR(INDEX($Q$3:$U$89, SMALL(IF($P$3:$P$89=\"○\", ROW($P$3:$P$89)-ROW($P$3)+1), ROW(C89)), COLUMNS($Q$3:S91)), \"\")","v":""},{"$f":"IFERROR(INDEX($Q$3:$U$89, SMALL(IF($P$3:$P$89=\"○\", ROW($P$3:$P$89)-ROW($P$3)+1), ROW(D89)), COLUMNS($Q$3:T91)), \"\")","v":""},{"$f":"IFERROR(INDEX($Q$3:$U$89, SMALL(IF($P$3:$P$89=\"○\", ROW($P$3:$P$89)-ROW($P$3)+1), ROW(E89)), COLUMNS($Q$3:U91)), \"\")","v":""}]
[null,null,null,null,null,null,null,null,null,null,null,null,null,null,null,null,{"$f":"IFERROR(INDEX($Q$3:$U$89, SMALL(IF($P$3:$P$89=\"○\", ROW($P$3:$P$89)-ROW($P$3)+1), ROW(A90)), COLUMNS($Q$3:Q92)), \"\")","v":""},{"$f":"IFERROR(INDEX($Q$3:$U$89, SMALL(IF($P$3:$P$89=\"○\", ROW($P$3:$P$89)-ROW($P$3)+1), ROW(B90)), COLUMNS($Q$3:R92)), \"\")","v":""},{"$f":"IFERROR(INDEX($Q$3:$U$89, SMALL(IF($P$3:$P$89=\"○\", ROW($P$3:$P$89)-ROW($P$3)+1), ROW(C90)), COLUMNS($Q$3:S92)), \"\")","v":""},{"$f":"IFERROR(INDEX($Q$3:$U$89, SMALL(IF($P$3:$P$89=\"○\", ROW($P$3:$P$89)-ROW($P$3)+1), ROW(D90)), COLUMNS($Q$3:T92)), \"\")","v":""},{"$f":"IFERROR(INDEX($Q$3:$U$89, SMALL(IF($P$3:$P$89=\"○\", ROW($P$3:$P$89)-ROW($P$3)+1), ROW(E90)), COLUMNS($Q$3:U92)), \"\")","v":""}]
[null,null,null,null,null,null,null,null,null,null,null,null,null,null,null,null,{"$f":"IFERROR(INDEX($Q$3:$U$89, SMALL(IF($P$3:$P$89=\"○\", ROW($P$3:$P$89)-ROW($P$3)+1), ROW(A91)), COLUMNS($Q$3:Q93)), \"\")","v":""},{"$f":"IFERROR(INDEX($Q$3:$U$89, SMALL(IF($P$3:$P$89=\"○\", ROW($P$3:$P$89)-ROW($P$3)+1), ROW(B91)), COLUMNS($Q$3:R93)), \"\")","v":""},{"$f":"IFERROR(INDEX($Q$3:$U$89, SMALL(IF($P$3:$P$89=\"○\", ROW($P$3:$P$89)-ROW($P$3)+1), ROW(C91)), COLUMNS($Q$3:S93)), \"\")","v":""},{"$f":"IFERROR(INDEX($Q$3:$U$89, SMALL(IF($P$3:$P$89=\"○\", ROW($P$3:$P$89)-ROW($P$3)+1), ROW(D91)), COLUMNS($Q$3:T93)), \"\")","v":""},{"$f":"IFERROR(INDEX($Q$3:$U$89, SMALL(IF($P$3:$P$89=\"○\", ROW($P$3:$P$89)-ROW($P$3)+1), ROW(E91)), COLUMNS($Q$3:U93)), \"\")","v":""}]
[null,null,null,null,null,null,null,null,null,null,null,null,null,null,null,null,{"$f":"IFERROR(INDEX($Q$3:$U$89, SMALL(IF($P$3:$P$89=\"○\", ROW($P$3:$P$89)-ROW($P$3)+1), ROW(A92)), COLUMNS($Q$3:Q94)), \"\")","v":""},{"$f":"IFERROR(INDEX($Q$3:$U$89, SMALL(IF($P$3:$P$89=\"○\", ROW($P$3:$P$89)-ROW($P$3)+1), ROW(B92)), COLUMNS($Q$3:R94)), \"\")","v":""},{"$f":"IFERROR(INDEX($Q$3:$U$89, SMALL(IF($P$3:$P$89=\"○\", ROW($P$3:$P$89)-ROW($P$3)+1), ROW(C92)), COLUMNS($Q$3:S94)), \"\")","v":""},{"$f":"IFERROR(INDEX($Q$3:$U$89, SMALL(IF($P$3:$P$89=\"○\", ROW($P$3:$P$89)-ROW($P$3)+1), ROW(D92)), COLUMNS($Q$3:T94)), \"\")","v":""},{"$f":"IFERROR(INDEX($Q$3:$U$89, SMALL(IF($P$3:$P$89=\"○\", ROW($P$3:$P$89)-ROW($P$3)+1), ROW(E92)), COLUMNS($Q$3:U94)), \"\")","v":""}]
[null,null,null,null,null,null,null,null,null,null,null,null,null,null,null,null,{"$f":"IFERROR(INDEX($Q$3:$U$89, SMALL(IF($P$3:$P$89=\"○\", ROW($P$3:$P$89)-ROW($P$3)+1), ROW(A93)), COLUMNS($Q$3:Q95)), \"\")","v":""},{"$f":"IFERROR(INDEX($Q$3:$U$89, SMALL(IF($P$3:$P$89=\"○\", ROW($P$3:$P$89)-ROW($P$3)+1), ROW(B93)), COLUMNS($Q$3:R95)), \"\")","v":""},{"$f":"IFERROR(INDEX($Q$3:$U$89, SMALL(IF($P$3:$P$89=\"○\", ROW($P$3:$P$89)-ROW($P$3)+1), ROW(C93)), COLUMNS($Q$3:S95)), \"\")","v":""},{"$f":"IFERROR(INDEX($Q$3:$U$89, SMALL(IF($P$3:$P$89=\"○\", ROW($P$3:$P$89)-ROW($P$3)+1), ROW(D93)), COLUMNS($Q$3:T95)), \"\")","v":""},{"$f":"IFERROR(INDEX($Q$3:$U$89, SMALL(IF($P$3:$P$89=\"○\", ROW($P$3:$P$89)-ROW($P$3)+1), ROW(E93)), COLUMNS($Q$3:U95)), \"\")","v":""}]
[null,null,null,null,null,null,null,null,null,null,null,null,null,null,null,null,{"$f":"IFERROR(INDEX($Q$3:$U$89, SMALL(IF($P$3:$P$89=\"○\", ROW($P$3:$P$89)-ROW($P$3)+1), ROW(A94)), COLUMNS($Q$3:Q96)), \"\")","v":""},{"$f":"IFERROR(INDEX($Q$3:$U$89, SMALL(IF($P$3:$P$89=\"○\", ROW($P$3:$P$89)-ROW($P$3)+1), ROW(B94)), COLUMNS($Q$3:R96)), \"\")","v":""},{"$f":"IFERROR(INDEX($Q$3:$U$89, SMALL(IF($P$3:$P$89=\"○\", ROW($P$3:$P$89)-ROW($P$3)+1), ROW(C94)), COLUMNS($Q$3:S96)), \"\")","v":""},{"$f":"IFERROR(INDEX($Q$3:$U$89, SMALL(IF($P$3:$P$89=\"○\", ROW($P$3:$P$89)-ROW($P$3)+1), ROW(D94)), COLUMNS($Q$3:T96)), \"\")","v":""},{"$f":"IFERROR(INDEX($Q$3:$U$89, SMALL(IF($P$3:$P$89=\"○\", ROW($P$3:$P$89)-ROW($P$3)+1), ROW(E94)), COLUMNS($Q$3:U96)), \"\")","v":""}]
[null,null,null,null,null,null,null,null,null,null,null,null,null,null,null,null,{"$f":"IFERROR(INDEX($Q$3:$U$89, SMALL(IF($P$3:$P$89=\"○\", ROW($P$3:$P$89)-ROW($P$3)+1), ROW(A95)), COLUMNS($Q$3:Q97)), \"\")","v":""},{"$f":"IFERROR(INDEX($Q$3:$U$89, SMALL(IF($P$3:$P$89=\"○\", ROW($P$3:$P$89)-ROW($P$3)+1), ROW(B95)), COLUMNS($Q$3:R97)), \"\")","v":""},{"$f":"IFERROR(INDEX($Q$3:$U$89, SMALL(IF($P$3:$P$89=\"○\", ROW($P$3:$P$89)-ROW($P$3)+1), ROW(C95)), COLUMNS($Q$3:S97)), \"\")","v":""},{"$f":"IFERROR(INDEX($Q$3:$U$89, SMALL(IF($P$3:$P$89=\"○\", ROW($P$3:$P$89)-ROW($P$3)+1), ROW(D95)), COLUMNS($Q$3:T97)), \"\")","v":""},{"$f":"IFERROR(INDEX($Q$3:$U$89, SMALL(IF($P$3:$P$89=\"○\", ROW($P$3:$P$89)-ROW($P$3)+1), ROW(E95)), COLUMNS($Q$3:U97)), \"\")","v":""}]
[null,null,null,null,null,null,null,null,null,null,null,null,null,null,null,null,{"$f":"IFERROR(INDEX($Q$3:$U$89, SMALL(IF($P$3:$P$89=\"○\", ROW($P$3:$P$89)-ROW($P$3)+1), ROW(A96)), COLUMNS($Q$3:Q98)), \"\")","v":""},{"$f":"IFERROR(INDEX($Q$3:$U$89, SMALL(IF($P$3:$P$89=\"○\", ROW($P$3:$P$89)-ROW($P$3)+1), ROW(B96)), COLUMNS($Q$3:R98)), \"\")","v":""},{"$f":"IFERROR(INDEX($Q$3:$U$89, SMALL(IF($P$3:$P$89=\"○\", ROW($P$3:$P$89)-ROW($P$3)+1), ROW(C96)), COLUMNS($Q$3:S98)), \"\")","v":""},{"$f":"IFERROR(INDEX($Q$3:$U$89, SMALL(IF($P$3:$P$89=\"○\", ROW($P$3:$P$89)-ROW($P$3)+1), ROW(D96)), COLUMNS($Q$3:T98)), \"\")","v":""},{"$f":"IFERROR(INDEX($Q$3:$U$89, SMALL(IF($P$3:$P$89=\"○\", ROW($P$3:$P$89)-ROW($P$3)+1), ROW(E96)), COLUMNS($Q$3:U98)), \"\")","v":""}]
[null,null,null,null,null,null,null,null,null,null,null,null,null,null,null,null,{"$f":"IFERROR(INDEX($Q$3:$U$89, SMALL(IF($P$3:$P$89=\"○\", ROW($P$3:$P$89)-ROW($P$3)+1), ROW(A97)), COLUMNS($Q$3:Q99)), \"\")","v":""},{"$f":"IFERROR(INDEX($Q$3:$U$89, SMALL(IF($P$3:$P$89=\"○\", ROW($P$3:$P$89)-ROW($P$3)+1), ROW(B97)), COLUMNS($Q$3:R99)), \"\")","v":""},{"$f":"IFERROR(INDEX($Q$3:$U$89, SMALL(IF($P$3:$P$89=\"○\", ROW($P$3:$P$89)-ROW($P$3)+1), ROW(C97)), COLUMNS($Q$3:S99)), \"\")","v":""},{"$f":"IFERROR(INDEX($Q$3:$U$89, SMALL(IF($P$3:$P$89=\"○\", ROW($P$3:$P$89)-ROW($P$3)+1), ROW(D97)), COLUMNS($Q$3:T99)), \"\")","v":""},{"$f":"IFERROR(INDEX($Q$3:$U$89, SMALL(IF($P$3:$P$89=\"○\", ROW($P$3:$P$89)-ROW($P$3)+1), ROW(E97)), COLUMNS($Q$3:U99)), \"\")","v":""}]
[null,null,null,null,null,null,null,null,null,null,null,null,null,null,null,null,{"$f":"IFERROR(INDEX($Q$3:$U$89, SMALL(IF($P$3:$P$89=\"○\", ROW($P$3:$P$89)-ROW($P$3)+1), ROW(A98)), COLUMNS($Q$3:Q100)), \"\")","v":""},{"$f":"IFERROR(INDEX($Q$3:$U$89, SMALL(IF($P$3:$P$89=\"○\", ROW($P$3:$P$89)-ROW($P$3)+1), ROW(B98)), COLUMNS($Q$3:R100)), \"\")","v":""},{"$f":"IFERROR(INDEX($Q$3:$U$89, SMALL(IF($P$3:$P$89=\"○\", ROW($P$3:$P$89)-ROW($P$3)+1), ROW(C98)), COLUMNS($Q$3:S100)), \"\")","v":""},{"$f":"IFERROR(INDEX($Q$3:$U$89, SMALL(IF($P$3:$P$89=\"○\", ROW($P$3:$P$89)-ROW($P$3)+1), ROW(D98)), COLUMNS($Q$3:T100)), \"\")","v":""},{"$f":"IFERROR(INDEX($Q$3:$U$89, SMALL(IF($P$3:$P$89=\"○\", ROW($P$3:$P$89)-ROW($P$3)+1), ROW(E98)), COLUMNS($Q$3:U100)), \"\")","v":""}]
[null,null,null,null,null,null,null,null,null,null,null,null,null,null,null,null,{"$f":"IFERROR(INDEX($Q$3:$U$89, SMALL(IF($P$3:$P$89=\"○\", ROW($P$3:$P$89)-ROW($P$3)+1), ROW(A99)), COLUMNS($Q$3:Q101)), \"\")","v":""},{"$f":"IFERROR(INDEX($Q$3:$U$89, SMALL(IF($P$3:$P$89=\"○\", ROW($P$3:$P$89)-ROW($P$3)+1), ROW(B99)), COLUMNS($Q$3:R101)), \"\")","v":""},{"$f":"IFERROR(INDEX($Q$3:$U$89, SMALL(IF($P$3:$P$89=\"○\", ROW($P$3:$P$89)-ROW($P$3)+1), ROW(C99)), COLUMNS($Q$3:S101)), \"\")","v":""},{"$f":"IFERROR(INDEX($Q$3:$U$89, SMALL(IF($P$3:$P$89=\"○\", ROW($P$3:$P$89)-ROW($P$3)+1), ROW(D99)), COLUMNS($Q$3:T101)), \"\")","v":""},{"$f":"IFERROR(INDEX($Q$3:$U$89, SMALL(IF($P$3:$P$89=\"○\", ROW($P$3:$P$89)-ROW($P$3)+1), ROW(E99)), COLUMNS($Q$3:U101)), \"\")","v":""}]
[null,null,null,null,null,null,null,null,null,null,null,null,null,null,null,null,{"$f":"IFERROR(INDEX($Q$3:$U$89, SMALL(IF($P$3:$P$89=\"○\", ROW($P$3:$P$89)-ROW($P$3)+1), ROW(A100)), COLUMNS($Q$3:Q102)), \"\")","v":""},{"$f":"IFERROR(INDEX($Q$3:$U$89, SMALL(IF($P$3:$P$89=\"○\", ROW($P$3:$P$89)-ROW($P$3)+1), ROW(B100)), COLUMNS($Q$3:R102)), \"\")","v":""},{"$f":"IFERROR(INDEX($Q$3:$U$89, SMALL(IF($P$3:$P$89=\"○\", ROW($P$3:$P$89)-ROW($P$3)+1), ROW(C100)), COLUMNS($Q$3:S102)), \"\")","v":""},{"$f":"IFERROR(INDEX($Q$3:$U$89, SMALL(IF($P$3:$P$89=\"○\", ROW($P$3:$P$89)-ROW($P$3)+1), ROW(D100)), COLUMNS($Q$3:T102)), \"\")","v":""},{"$f":"IFERROR(INDEX($Q$3:$U$89, SMALL(IF($P$3:$P$89=\"○\", ROW($P$3:$P$89)-ROW($P$3)+1), ROW(E100)), COLUMNS($Q$3:U102)), \"\")","v":""}]
[null,null,null,null,null,null,null,null,null,null,null,null,null,null,null,null,{"$f":"IFERROR(INDEX($Q$3:$U$89, SMALL(IF($P$3:$P$89=\"○\", ROW($P$3:$P$89)-ROW($P$3)+1), ROW(A101)), COLUMNS($Q$3:Q103)), \"\")","v":""},{"$f":"IFERROR(INDEX($Q$3:$U$89, SMALL(IF($P$3:$P$89=\"○\", ROW($P$3:$P$89)-ROW($P$3)+1), ROW(B101)), COLUMNS($Q$3:R103)), \"\")","v":""},{"$f":"IFERROR(INDEX($Q$3:$U$89, SMALL(IF($P$3:$P$89=\"○\", ROW($P$3:$P$89)-ROW($P$3)+1), ROW(C101)), COLUMNS($Q$3:S103)), \"\")","v":""},{"$f":"IFERROR(INDEX($Q$3:$U$89, SMALL(IF($P$3:$P$89=\"○\", ROW($P$3:$P$89)-ROW($P$3)+1), ROW(D101)), COLUMNS($Q$3:T103)), \"\")","v":""},{"$f":"IFERROR(INDEX($Q$3:$U$89, SMALL(IF($P$3:$P$89=\"○\", ROW($P$3:$P$89)-ROW($P$3)+1), ROW(E101)), COLUMNS($Q$3:U103)), \"\")","v":""}]
[null,null,null,null,null,null,null,null,null,null,null,null,null,null,null,null,{"$f":"IFERROR(INDEX($Q$3:$U$89, SMALL(IF($P$3:$P$89=\"○\", ROW($P$3:$P$89)-ROW($P$3)+1), ROW(A102)), COLUMNS($Q$3:Q104)), \"\")","v":""},{"$f":"IFERROR(INDEX($Q$3:$U$89, SMALL(IF($P$3:$P$89=\"○\", ROW($P$3:$P$89)-ROW($P$3)+1), ROW(B102)), COLUMNS($Q$3:R104)), \"\")","v":""},{"$f":"IFERROR(INDEX($Q$3:$U$89, SMALL(IF($P$3:$P$89=\"○\", ROW($P$3:$P$89)-ROW($P$3)+1), ROW(C102)), COLUMNS($Q$3:S104)), \"\")","v":""},{"$f":"IFERROR(INDEX($Q$3:$U$89, SMALL(IF($P$3:$P$89=\"○\", ROW($P$3:$P$89)-ROW($P$3)+1), ROW(D102)), COLUMNS($Q$3:T104)), \"\")","v":""},{"$f":"IFERROR(INDEX($Q$3:$U$89, SMALL(IF($P$3:$P$89=\"○\", ROW($P$3:$P$89)-ROW($P$3)+1), ROW(E102)), COLUMNS($Q$3:U104)), \"\")","v":""}]
[null,null,null,null,null,null,null,null,null,null,null,null,null,null,null,null,{"$f":"IFERROR(INDEX($Q$3:$U$89, SMALL(IF($P$3:$P$89=\"○\", ROW($P$3:$P$89)-ROW($P$3)+1), ROW(A103)), COLUMNS($Q$3:Q105)), \"\")","v":""},{"$f":"IFERROR(INDEX($Q$3:$U$89, SMALL(IF($P$3:$P$89=\"○\", ROW($P$3:$P$89)-ROW($P$3)+1), ROW(B103)), COLUMNS($Q$3:R105)), \"\")","v":""},{"$f":"IFERROR(INDEX($Q$3:$U$89, SMALL(IF($P$3:$P$89=\"○\", ROW($P$3:$P$89)-ROW($P$3)+1), ROW(C103)), COLUMNS($Q$3:S105)), \"\")","v":""},{"$f":"IFERROR(INDEX($Q$3:$U$89, SMALL(IF($P$3:$P$89=\"○\", ROW($P$3:$P$89)-ROW($P$3)+1), ROW(D103)), COLUMNS($Q$3:T105)), \"\")","v":""},{"$f":"IFERROR(INDEX($Q$3:$U$89, SMALL(IF($P$3:$P$89=\"○\", ROW($P$3:$P$89)-ROW($P$3)+1), ROW(E103)), COLUMNS($Q$3:U105)), \"\")","v":""}]
[null,null,null,null,null,null,null,null,null,null,null,null,null,null,null,null,{"$f":"IFERROR(INDEX($Q$3:$U$89, SMALL(IF($P$3:$P$89=\"○\", ROW($P$3:$P$89)-ROW($P$3)+1), ROW(A104)), COLUMNS($Q$3:Q106)), \"\")","v":""},{"$f":"IFERROR(INDEX($Q$3:$U$89, SMALL(IF($P$3:$P$89=\"○\", ROW($P$3:$P$89)-ROW($P$3)+1), ROW(B104)), COLUMNS($Q$3:R106)), \"\")","v":""},{"$f":"IFERROR(INDEX($Q$3:$U$89, SMALL(IF($P$3:$P$89=\"○\", ROW($P$3:$P$89)-ROW($P$3)+1), ROW(C104)), COLUMNS($Q$3:S106)), \"\")","v":""},{"$f":"IFERROR(INDEX($Q$3:$U$89, SMALL(IF($P$3:$P$89=\"○\", ROW($P$3:$P$89)-ROW($P$3)+1), ROW(D104)), COLUMNS($Q$3:T106)), \"\")","v":""},{"$f":"IFERROR(INDEX($Q$3:$U$89, SMALL(IF($P$3:$P$89=\"○\", ROW($P$3:$P$89)-ROW($P$3)+1), ROW(E104)), COLUMNS($Q$3:U106)), \"\")","v":""}]
[null,null,null,null,null,null,null,null,null,null,null,null,null,null,null,null,{"$f":"IFERROR(INDEX($Q$3:$U$89, SMALL(IF($P$3:$P$89=\"○\", ROW($P$3:$P$89)-ROW($P$3)+1), ROW(A105)), COLUMNS($Q$3:Q107)), \"\")","v":""},{"$f":"IFERROR(INDEX($Q$3:$U$89, SMALL(IF($P$3:$P$89=\"○\", ROW($P$3:$P$89)-ROW($P$3)+1), ROW(B105)), COLUMNS($Q$3:R107)), \"\")","v":""},{"$f":"IFERROR(INDEX($Q$3:$U$89, SMALL(IF($P$3:$P$89=\"○\", ROW($P$3:$P$89)-ROW($P$3)+1), ROW(C105)), COLUMNS($Q$3:S107)), \"\")","v":""},{"$f":"IFERROR(INDEX($Q$3:$U$89, SMALL(IF($P$3:$P$89=\"○\", ROW($P$3:$P$89)-ROW($P$3)+1), ROW(D105)), COLUMNS($Q$3:T107)), \"\")","v":""},{"$f":"IFERROR(INDEX($Q$3:$U$89, SMALL(IF($P$3:$P$89=\"○\", ROW($P$3:$P$89)-ROW($P$3)+1), ROW(E105)), COLUMNS($Q$3:U107)), \"\")","v":""}]
[null,null,null,null,null,null,null,null,null,null,null,null,null,null,null,null,{"$f":"IFERROR(INDEX($Q$3:$U$89, SMALL(IF($P$3:$P$89=\"○\", ROW($P$3:$P$89)-ROW($P$3)+1), ROW(A106)), COLUMNS($Q$3:Q108)), \"\")","v":""},{"$f":"IFERROR(INDEX($Q$3:$U$89, SMALL(IF($P$3:$P$89=\"○\", ROW($P$3:$P$89)-ROW($P$3)+1), ROW(B106)), COLUMNS($Q$3:R108)), \"\")","v":""},{"$f":"IFERROR(INDEX($Q$3:$U$89, SMALL(IF($P$3:$P$89=\"○\", ROW($P$3:$P$89)-ROW($P$3)+1), ROW(C106)), COLUMNS($Q$3:S108)), \"\")","v":""},{"$f":"IFERROR(INDEX($Q$3:$U$89, SMALL(IF($P$3:$P$89=\"○\", ROW($P$3:$P$89)-ROW($P$3)+1), ROW(D106)), COLUMNS($Q$3:T108)), \"\")","v":""},{"$f":"IFERROR(INDEX($Q$3:$U$89, SMALL(IF($P$3:$P$89=\"○\", ROW($P$3:$P$89)-ROW($P$3)+1), ROW(E106)), COLUMNS($Q$3:U108)), \"\")","v":""}]
[null,null,null,null,null,null,null,null,null,null,null,null,null,null,null,null,{"$f":"IFERROR(INDEX($Q$3:$U$89, SMALL(IF($P$3:$P$89=\"○\", ROW($P$3:$P$89)-ROW($P$3)+1), ROW(A107)), COLUMNS($Q$3:Q109)), \"\")","v":""},{"$f":"IFERROR(INDEX($Q$3:$U$89, SMALL(IF($P$3:$P$89=\"○\", ROW($P$3:$P$89)-ROW($P$3)+1), ROW(B107)), COLUMNS($Q$3:R109)), \"\")","v":""},{"$f":"IFERROR(INDEX($Q$3:$U$89, SMALL(IF($P$3:$P$89=\"○\", ROW($P$3:$P$89)-ROW($P$3)+1), ROW(C107)), COLUMNS($Q$3:S109)), \"\")","v":""},{"$f":"IFERROR(INDEX($Q$3:$U$89, SMALL(IF($P$3:$P$89=\"○\", ROW($P$3:$P$89)-ROW($P$3)+1), ROW(D107)), COLUMNS($Q$3:T109)), \"\")","v":""},{"$f":"IFERROR(INDEX($Q$3:$U$89, SMALL(IF($P$3:$P$89=\"○\", ROW($P$3:$P$89)-ROW($P$3)+1), ROW(E107)), COLUMNS($Q$3:U109)), \"\")","v":""}]
[null,null,null,null,null,null,null,null,null,null,null,null,null,null,null,null,{"$f":"IFERROR(INDEX($Q$3:$U$89, SMALL(IF($P$3:$P$89=\"○\", ROW($P$3:$P$89)-ROW($P$3)+1), ROW(A108)), COLUMNS($Q$3:Q110)), \"\")","v":""},{"$f":"IFERROR(INDEX($Q$3:$U$89, SMALL(IF($P$3:$P$89=\"○\", ROW($P$3:$P$89)-ROW($P$3)+1), ROW(B108)), COLUMNS($Q$3:R110)), \"\")","v":""},{"$f":"IFERROR(INDEX($Q$3:$U$89, SMALL(IF($P$3:$P$89=\"○\", ROW($P$3:$P$89)-ROW($P$3)+1), ROW(C108)), COLUMNS($Q$3:S110)), \"\")","v":""},{"$f":"IFERROR(INDEX($Q$3:$U$89, SMALL(IF($P$3:$P$89=\"○\", ROW($P$3:$P$89)-ROW($P$3)+1), ROW(D108)), COLUMNS($Q$3:T110)), \"\")","v":""},{"$f":"IFERROR(INDEX($Q$3:$U$89, SMALL(IF($P$3:$P$89=\"○\", ROW($P$3:$P$89)-ROW($P$3)+1), ROW(E108)), COLUMNS($Q$3:U110)), \"\")","v":""}]
[null,null,null,null,null,null,null,null,null,null,null,null,null,null,null,null,{"$f":"IFERROR(INDEX($Q$3:$U$89, SMALL(IF($P$3:$P$89=\"○\", ROW($P$3:$P$89)-ROW($P$3)+1), ROW(A109)), COLUMNS($Q$3:Q111)), \"\")","v":""},{"$f":"IFERROR(INDEX($Q$3:$U$89, SMALL(IF($P$3:$P$89=\"○\", ROW($P$3:$P$89)-ROW($P$3)+1), ROW(B109)), COLUMNS($Q$3:R111)), \"\")","v":""},{"$f":"IFERROR(INDEX($Q$3:$U$89, SMALL(IF($P$3:$P$89=\"○\", ROW($P$3:$P$89)-ROW($P$3)+1), ROW(C109)), COLUMNS($Q$3:S111)), \"\")","v":""},{"$f":"IFERROR(INDEX($Q$3:$U$89, SMALL(IF($P$3:$P$89=\"○\", ROW($P$3:$P$89)-ROW($P$3)+1), ROW(D109)), COLUMNS($Q$3:T111)), \"\")","v":""},{"$f":"IFERROR(INDEX($Q$3:$U$89, SMALL(IF($P$3:$P$89=\"○\", ROW($P$3:$P$89)-ROW($P$3)+1), ROW(E109)), COLUMNS($Q$3:U111)), \"\")","v":""}]
[null,null,null,null,null,null,null,null,null,null,null,null,null,null,null,null,{"$f":"IFERROR(INDEX($Q$3:$U$89, SMALL(IF($P$3:$P$89=\"○\", ROW($P$3:$P$89)-ROW($P$3)+1), ROW(A110)), COLUMNS($Q$3:Q112)), \"\")","v":""},{"$f":"IFERROR(INDEX($Q$3:$U$89, SMALL(IF($P$3:$P$89=\"○\", ROW($P$3:$P$89)-ROW($P$3)+1), ROW(B110)), COLUMNS($Q$3:R112)), \"\")","v":""},{"$f":"IFERROR(INDEX($Q$3:$U$89, SMALL(IF($P$3:$P$89=\"○\", ROW($P$3:$P$89)-ROW($P$3)+1), ROW(C110)), COLUMNS($Q$3:S112)), \"\")","v":""},{"$f":"IFERROR(INDEX($Q$3:$U$89, SMALL(IF($P$3:$P$89=\"○\", ROW($P$3:$P$89)-ROW($P$3)+1), ROW(D110)), COLUMNS($Q$3:T112)), \"\")","v":""},{"$f":"IFERROR(INDEX($Q$3:$U$89, SMALL(IF($P$3:$P$89=\"○\", ROW($P$3:$P$89)-ROW($P$3)+1), ROW(E110)), COLUMNS($Q$3:U112)), \"\")","v":""}]
[null,null,null,null,null,null,null,null,null,null,null,null,null,null,null,null,{"$f":"IFERROR(INDEX($Q$3:$U$89, SMALL(IF($P$3:$P$89=\"○\", ROW($P$3:$P$89)-ROW($P$3)+1), ROW(A111)), COLUMNS($Q$3:Q113)), \"\")","v":""},{"$f":"IFERROR(INDEX($Q$3:$U$89, SMALL(IF($P$3:$P$89=\"○\", ROW($P$3:$P$89)-ROW($P$3)+1), ROW(B111)), COLUMNS($Q$3:R113)), \"\")","v":""},{"$f":"IFERROR(INDEX($Q$3:$U$89, SMALL(IF($P$3:$P$89=\"○\", ROW($P$3:$P$89)-ROW($P$3)+1), ROW(C111)), COLUMNS($Q$3:S113)), \"\")","v":""},{"$f":"IFERROR(INDEX($Q$3:$U$89, SMALL(IF($P$3:$P$89=\"○\", ROW($P$3:$P$89)-ROW($P$3)+1), ROW(D111)), COLUMNS($Q$3:T113)), \"\")","v":""},{"$f":"IFERROR(INDEX($Q$3:$U$89, SMALL(IF($P$3:$P$89=\"○\", ROW($P$3:$P$89)-ROW($P$3)+1), ROW(E111)), COLUMNS($Q$3:U113)), \"\")","v":""}]
[null,null,null,null,null,null,null,null,null,null,null,null,null,null,null,null,{"$f":"IFERROR(INDEX($Q$3:$U$89, SMALL(IF($P$3:$P$89=\"○\", ROW($P$3:$P$89)-ROW($P$3)+1), ROW(A112)), COLUMNS($Q$3:Q114)), \"\")","v":""},{"$f":"IFERROR(INDEX($Q$3:$U$89, SMALL(IF($P$3:$P$89=\"○\", ROW($P$3:$P$89)-ROW($P$3)+1), ROW(B112)), COLUMNS($Q$3:R114)), \"\")","v":""},{"$f":"IFERROR(INDEX($Q$3:$U$89, SMALL(IF($P$3:$P$89=\"○\", ROW($P$3:$P$89)-ROW($P$3)+1), ROW(C112)), COLUMNS($Q$3:S114)), \"\")","v":""},{"$f":"IFERROR(INDEX($Q$3:$U$89, SMALL(IF($P$3:$P$89=\"○\", ROW($P$3:$P$89)-ROW($P$3)+1), ROW(D112)), COLUMNS($Q$3:T114)), \"\")","v":""},{"$f":"IFERROR(INDEX($Q$3:$U$89, SMALL(IF($P$3:$P$89=\"○\", ROW($P$3:$P$89)-ROW($P$3)+1), ROW(E112)), COLUMNS($Q$3:U114)), \"\")","v":""}]
[null,null,null,null,null,null,null,null,null,null,null,null,null,null,null,null,{"$f":"IFERROR(INDEX($Q$3:$U$89, SMALL(IF($P$3:$P$89=\"○\", ROW($P$3:$P$89)-ROW($P$3)+1), ROW(A113)), COLUMNS($Q$3:Q115)), \"\")","v":""},{"$f":"IFERROR(INDEX($Q$3:$U$89, SMALL(IF($P$3:$P$89=\"○\", ROW($P$3:$P$89)-ROW($P$3)+1), ROW(B113)), COLUMNS($Q$3:R115)), \"\")","v":""},{"$f":"IFERROR(INDEX($Q$3:$U$89, SMALL(IF($P$3:$P$89=\"○\", ROW($P$3:$P$89)-ROW($P$3)+1), ROW(C113)), COLUMNS($Q$3:S115)), \"\")","v":""},{"$f":"IFERROR(INDEX($Q$3:$U$89, SMALL(IF($P$3:$P$89=\"○\", ROW($P$3:$P$89)-ROW($P$3)+1), ROW(D113)), COLUMNS($Q$3:T115)), \"\")","v":""},{"$f":"IFERROR(INDEX($Q$3:$U$89, SMALL(IF($P$3:$P$89=\"○\", ROW($P$3:$P$89)-ROW($P$3)+1), ROW(E113)), COLUMNS($Q$3:U115)), \"\")","v":""}]
[null,null,null,null,null,null,null,null,null,null,null,null,null,null,null,null,{"$f":"IFERROR(INDEX($Q$3:$U$89, SMALL(IF($P$3:$P$89=\"○\", ROW($P$3:$P$89)-ROW($P$3)+1), ROW(A114)), COLUMNS($Q$3:Q116)), \"\")","v":""},{"$f":"IFERROR(INDEX($Q$3:$U$89, SMALL(IF($P$3:$P$89=\"○\", ROW($P$3:$P$89)-ROW($P$3)+1), ROW(B114)), COLUMNS($Q$3:R116)), \"\")","v":""},{"$f":"IFERROR(INDEX($Q$3:$U$89, SMALL(IF($P$3:$P$89=\"○\", ROW($P$3:$P$89)-ROW($P$3)+1), ROW(C114)), COLUMNS($Q$3:S116)), \"\")","v":""},{"$f":"IFERROR(INDEX($Q$3:$U$89, SMALL(IF($P$3:$P$89=\"○\", ROW($P$3:$P$89)-ROW($P$3)+1), ROW(D114)), COLUMNS($Q$3:T116)), \"\")","v":""},{"$f":"IFERROR(INDEX($Q$3:$U$89, SMALL(IF($P$3:$P$89=\"○\", ROW($P$3:$P$89)-ROW($P$3)+1), ROW(E114)), COLUMNS($Q$3:U116)), \"\")","v":""}]
[null,null,null,null,null,null,null,null,null,null,null,null,null,null,null,null,{"$f":"IFERROR(INDEX($Q$3:$U$89, SMALL(IF($P$3:$P$89=\"○\", ROW($P$3:$P$89)-ROW($P$3)+1), ROW(A115)), COLUMNS($Q$3:Q117)), \"\")","v":""},{"$f":"IFERROR(INDEX($Q$3:$U$89, SMALL(IF($P$3:$P$89=\"○\", ROW($P$3:$P$89)-ROW($P$3)+1), ROW(B115)), COLUMNS($Q$3:R117)), \"\")","v":""},{"$f":"IFERROR(INDEX($Q$3:$U$89, SMALL(IF($P$3:$P$89=\"○\", ROW($P$3:$P$89)-ROW($P$3)+1), ROW(C115)), COLUMNS($Q$3:S117)), \"\")","v":""},{"$f":"IFERROR(INDEX($Q$3:$U$89, SMALL(IF($P$3:$P$89=\"○\", ROW($P$3:$P$89)-ROW($P$3)+1), ROW(D115)), COLUMNS($Q$3:T117)), \"\")","v":""},{"$f":"IFERROR(INDEX($Q$3:$U$89, SMALL(IF($P$3:$P$89=\"○\", ROW($P$3:$P$89)-ROW($P$3)+1), ROW(E115)), COLUMNS($Q$3:U117)), \"\")","v":""}]
[null,null,null,null,null,null,null,null,null,null,null,null,null,null,null,null,{"$f":"IFERROR(INDEX($Q$3:$U$89, SMALL(IF($P$3:$P$89=\"○\", ROW($P$3:$P$89)-ROW($P$3)+1), ROW(A116)), COLUMNS($Q$3:Q118)), \"\")","v":""},{"$f":"IFERROR(INDEX($Q$3:$U$89, SMALL(IF($P$3:$P$89=\"○\", ROW($P$3:$P$89)-ROW($P$3)+1), ROW(B116)), COLUMNS($Q$3:R118)), \"\")","v":""},{"$f":"IFERROR(INDEX($Q$3:$U$89, SMALL(IF($P$3:$P$89=\"○\", ROW($P$3:$P$89)-ROW($P$3)+1), ROW(C116)), COLUMNS($Q$3:S118)), \"\")","v":""},{"$f":"IFERROR(INDEX($Q$3:$U$89, SMALL(IF($P$3:$P$89=\"○\", ROW($P$3:$P$89)-ROW($P$3)+1), ROW(D116)), COLUMNS($Q$3:T118)), \"\")","v":""},{"$f":"IFERROR(INDEX($Q$3:$U$89, SMALL(IF($P$3:$P$89=\"○\", ROW($P$3:$P$89)-ROW($P$3)+1), ROW(E116)), COLUMNS($Q$3:U118)), \"\")","v":""}]
[null,null,null,null,null,null,null,null,null,null,null,null,null,null,null,null,{"$f":"IFERROR(INDEX($Q$3:$U$89, SMALL(IF($P$3:$P$89=\"○\", ROW($P$3:$P$89)-ROW($P$3)+1), ROW(A117)), COLUMNS($Q$3:Q119)), \"\")","v":""},{"$f":"IFERROR(INDEX($Q$3:$U$89, SMALL(IF($P$3:$P$89=\"○\", ROW($P$3:$P$89)-ROW($P$3)+1), ROW(B117)), COLUMNS($Q$3:R119)), \"\")","v":""},{"$f":"IFERROR(INDEX($Q$3:$U$89, SMALL(IF($P$3:$P$89=\"○\", ROW($P$3:$P$89)-ROW($P$3)+1), ROW(C117)), COLUMNS($Q$3:S119)), \"\")","v":""},{"$f":"IFERROR(INDEX($Q$3:$U$89, SMALL(IF($P$3:$P$89=\"○\", ROW($P$3:$P$89)-ROW($P$3)+1), ROW(D117)), COLUMNS($Q$3:T119)), \"\")","v":""},{"$f":"IFERROR(INDEX($Q$3:$U$89, SMALL(IF($P$3:$P$89=\"○\", ROW($P$3:$P$89)-ROW($P$3)+1), ROW(E117)), COLUMNS($Q$3:U119)), \"\")","v":""}]
[null,null,null,null,null,null,null,null,null,null,null,null,null,null,null,null,{"$f":"IFERROR(INDEX($Q$3:$U$89, SMALL(IF($P$3:$P$89=\"○\", ROW($P$3:$P$89)-ROW($P$3)+1), ROW(A118)), COLUMNS($Q$3:Q120)), \"\")","v":""},{"$f":"IFERROR(INDEX($Q$3:$U$89, SMALL(IF($P$3:$P$89=\"○\", ROW($P$3:$P$89)-ROW($P$3)+1), ROW(B118)), COLUMNS($Q$3:R120)), \"\")","v":""},{"$f":"IFERROR(INDEX($Q$3:$U$89, SMALL(IF($P$3:$P$89=\"○\", ROW($P$3:$P$89)-ROW($P$3)+1), ROW(C118)), COLUMNS($Q$3:S120)), \"\")","v":""},{"$f":"IFERROR(INDEX($Q$3:$U$89, SMALL(IF($P$3:$P$89=\"○\", ROW($P$3:$P$89)-ROW($P$3)+1), ROW(D118)), COLUMNS($Q$3:T120)), \"\")","v":""},{"$f":"IFERROR(INDEX($Q$3:$U$89, SMALL(IF($P$3:$P$89=\"○\", ROW($P$3:$P$89)-ROW($P$3)+1), ROW(E118)), COLUMNS($Q$3:U120)), \"\")","v":""}]
[null,null,null,null,null,null,null,null,null,null,null,null,null,null,null,null,{"$f":"IFERROR(INDEX($Q$3:$U$89, SMALL(IF($P$3:$P$89=\"○\", ROW($P$3:$P$89)-ROW($P$3)+1), ROW(A119)), COLUMNS($Q$3:Q121)), \"\")","v":""},{"$f":"IFERROR(INDEX($Q$3:$U$89, SMALL(IF($P$3:$P$89=\"○\", ROW($P$3:$P$89)-ROW($P$3)+1), ROW(B119)), COLUMNS($Q$3:R121)), \"\")","v":""},{"$f":"IFERROR(INDEX($Q$3:$U$89, SMALL(IF($P$3:$P$89=\"○\", ROW($P$3:$P$89)-ROW($P$3)+1), ROW(C119)), COLUMNS($Q$3:S121)), \"\")","v":""},{"$f":"IFERROR(INDEX($Q$3:$U$89, SMALL(IF($P$3:$P$89=\"○\", ROW($P$3:$P$89)-ROW($P$3)+1), ROW(D119)), COLUMNS($Q$3:T121)), \"\")","v":""},{"$f":"IFERROR(INDEX($Q$3:$U$89, SMALL(IF($P$3:$P$89=\"○\", ROW($P$3:$P$89)-ROW($P$3)+1), ROW(E119)), COLUMNS($Q$3:U121)), \"\")","v":""}]
[null,null,null,null,null,null,null,null,null,null,null,null,null,null,null,null,{"$f":"IFERROR(INDEX($Q$3:$U$89, SMALL(IF($P$3:$P$89=\"○\", ROW($P$3:$P$89)-ROW($P$3)+1), ROW(A120)), COLUMNS($Q$3:Q122)), \"\")","v":""},{"$f":"IFERROR(INDEX($Q$3:$U$89, SMALL(IF($P$3:$P$89=\"○\", ROW($P$3:$P$89)-ROW($P$3)+1), ROW(B120)), COLUMNS($Q$3:R122)), \"\")","v":""},{"$f":"IFERROR(INDEX($Q$3:$U$89, SMALL(IF($P$3:$P$89=\"○\", ROW($P$3:$P$89)-ROW($P$3)+1), ROW(C120)), COLUMNS($Q$3:S122)), \"\")","v":""},{"$f":"IFERROR(INDEX($Q$3:$U$89, SMALL(IF($P$3:$P$89=\"○\", ROW($P$3:$P$89)-ROW($P$3)+1), ROW(D120)), COLUMNS($Q$3:T122)), \"\")","v":""},{"$f":"IFERROR(INDEX($Q$3:$U$89, SMALL(IF($P$3:$P$89=\"○\", ROW($P$3:$P$89)-ROW($P$3)+1), ROW(E120)), COLUMNS($Q$3:U122)), \"\")","v":""}]
[null,null,null,null,null,null,null,null,null,null,null,null,null,null,null,null,{"$f":"IFERROR(INDEX($Q$3:$U$89, SMALL(IF($P$3:$P$89=\"○\", ROW($P$3:$P$89)-ROW($P$3)+1), ROW(A121)), COLUMNS($Q$3:Q123)), \"\")","v":""},{"$f":"IFERROR(INDEX($Q$3:$U$89, SMALL(IF($P$3:$P$89=\"○\", ROW($P$3:$P$89)-ROW($P$3)+1), ROW(B121)), COLUMNS($Q$3:R123)), \"\")","v":""},{"$f":"IFERROR(INDEX($Q$3:$U$89, SMALL(IF($P$3:$P$89=\"○\", ROW($P$3:$P$89)-ROW($P$3)+1), ROW(C121)), COLUMNS($Q$3:S123)), \"\")","v":""},{"$f":"IFERROR(INDEX($Q$3:$U$89, SMALL(IF($P$3:$P$89=\"○\", ROW($P$3:$P$89)-ROW($P$3)+1), ROW(D121)), COLUMNS($Q$3:T123)), \"\")","v":""},{"$f":"IFERROR(INDEX($Q$3:$U$89, SMALL(IF($P$3:$P$89=\"○\", ROW($P$3:$P$89)-ROW($P$3)+1), ROW(E121)), COLUMNS($Q$3:U123)), \"\")","v":""}]
[null,null,null,null,null,null,null,null,null,null,null,null,null,null,null,null,{"$f":"IFERROR(INDEX($Q$3:$U$89, SMALL(IF($P$3:$P$89=\"○\", ROW($P$3:$P$89)-ROW($P$3)+1), ROW(A122)), COLUMNS($Q$3:Q124)), \"\")","v":""},{"$f":"IFERROR(INDEX($Q$3:$U$89, SMALL(IF($P$3:$P$89=\"○\", ROW($P$3:$P$89)-ROW($P$3)+1), ROW(B122)), COLUMNS($Q$3:R124)), \"\")","v":""},{"$f":"IFERROR(INDEX($Q$3:$U$89, SMALL(IF($P$3:$P$89=\"○\", ROW($P$3:$P$89)-ROW($P$3)+1), ROW(C122)), COLUMNS($Q$3:S124)), \"\")","v":""},{"$f":"IFERROR(INDEX($Q$3:$U$89, SMALL(IF($P$3:$P$89=\"○\", ROW($P$3:$P$89)-ROW($P$3)+1), ROW(D122)), COLUMNS($Q$3:T124)), \"\")","v":""},{"$f":"IFERROR(INDEX($Q$3:$U$89, SMALL(IF($P$3:$P$89=\"○\", ROW($P$3:$P$89)-ROW($P$3)+1), ROW(E122)), COLUMNS($Q$3:U124)), \"\")","v":""}]
[null,null,null,null,null,null,null,null,null,null,null,null,null,null,null,null,{"$f":"IFERROR(INDEX($Q$3:$U$89, SMALL(IF($P$3:$P$89=\"○\", ROW($P$3:$P$89)-ROW($P$3)+1), ROW(A123)), COLUMNS($Q$3:Q125)), \"\")","v":""},{"$f":"IFERROR(INDEX($Q$3:$U$89, SMALL(IF($P$3:$P$89=\"○\", ROW($P$3:$P$89)-ROW($P$3)+1), ROW(B123)), COLUMNS($Q$3:R125)), \"\")","v":""},{"$f":"IFERROR(INDEX($Q$3:$U$89, SMALL(IF($P$3:$P$89=\"○\", ROW($P$3:$P$89)-ROW($P$3)+1), ROW(C123)), COLUMNS($Q$3:S125)), \"\")","v":""},{"$f":"IFERROR(INDEX($Q$3:$U$89, SMALL(IF($P$3:$P$89=\"○\", ROW($P$3:$P$89)-ROW($P$3)+1), ROW(D123)), COLUMNS($Q$3:T125)), \"\")","v":""},{"$f":"IFERROR(INDEX($Q$3:$U$89, SMALL(IF($P$3:$P$89=\"○\", ROW($P$3:$P$89)-ROW($P$3)+1), ROW(E123)), COLUMNS($Q$3:U125)), \"\")","v":""}]
[null,null,null,null,null,null,null,null,null,null,null,null,null,null,null,null,{"$f":"IFERROR(INDEX($Q$3:$U$89, SMALL(IF($P$3:$P$89=\"○\", ROW($P$3:$P$89)-ROW($P$3)+1), ROW(A124)), COLUMNS($Q$3:Q126)), \"\")","v":""},{"$f":"IFERROR(INDEX($Q$3:$U$89, SMALL(IF($P$3:$P$89=\"○\", ROW($P$3:$P$89)-ROW($P$3)+1), ROW(B124)), COLUMNS($Q$3:R126)), \"\")","v":""},{"$f":"IFERROR(INDEX($Q$3:$U$89, SMALL(IF($P$3:$P$89=\"○\", ROW($P$3:$P$89)-ROW($P$3)+1), ROW(C124)), COLUMNS($Q$3:S126)), \"\")","v":""},{"$f":"IFERROR(INDEX($Q$3:$U$89, SMALL(IF($P$3:$P$89=\"○\", ROW($P$3:$P$89)-ROW($P$3)+1), ROW(D124)), COLUMNS($Q$3:T126)), \"\")","v":""},{"$f":"IFERROR(INDEX($Q$3:$U$89, SMALL(IF($P$3:$P$89=\"○\", ROW($P$3:$P$89)-ROW($P$3)+1), ROW(E124)), COLUMNS($Q$3:U126)), \"\")","v":""}]
[null,null,null,null,null,null,null,null,null,null,null,null,null,null,null,null,{"$f":"IFERROR(INDEX($Q$3:$U$89, SMALL(IF($P$3:$P$89=\"○\", ROW($P$3:$P$89)-ROW($P$3)+1), ROW(A125)), COLUMNS($Q$3:Q127)), \"\")","v":""},{"$f":"IFERROR(INDEX($Q$3:$U$89, SMALL(IF($P$3:$P$89=\"○\", ROW($P$3:$P$89)-ROW($P$3)+1), ROW(B125)), COLUMNS($Q$3:R127)), \"\")","v":""},{"$f":"IFERROR(INDEX($Q$3:$U$89, SMALL(IF($P$3:$P$89=\"○\", ROW($P$3:$P$89)-ROW($P$3)+1), ROW(C125)), COLUMNS($Q$3:S127)), \"\")","v":""},{"$f":"IFERROR(INDEX($Q$3:$U$89, SMALL(IF($P$3:$P$89=\"○\", ROW($P$3:$P$89)-ROW($P$3)+1), ROW(D125)), COLUMNS($Q$3:T127)), \"\")","v":""},{"$f":"IFERROR(INDEX($Q$3:$U$89, SMALL(IF($P$3:$P$89=\"○\", ROW($P$3:$P$89)-ROW($P$3)+1), ROW(E125)), COLUMNS($Q$3:U127)), \"\")","v":""}]
[null,null,null,null,null,null,null,null,null,null,null,null,null,null,null,null,{"$f":"IFERROR(INDEX($Q$3:$U$89, SMALL(IF($P$3:$P$89=\"○\", ROW($P$3:$P$89)-ROW($P$3)+1), ROW(A126)), COLUMNS($Q$3:Q128)), \"\")","v":""},{"$f":"IFERROR(INDEX($Q$3:$U$89, SMALL(IF($P$3:$P$89=\"○\", ROW($P$3:$P$89)-ROW($P$3)+1), ROW(B126)), COLUMNS($Q$3:R128)), \"\")","v":""},{"$f":"IFERROR(INDEX($Q$3:$U$89, SMALL(IF($P$3:$P$89=\"○\", ROW($P$3:$P$89)-ROW($P$3)+1), ROW(C126)), COLUMNS($Q$3:S128)), \"\")","v":""},{"$f":"IFERROR(INDEX($Q$3:$U$89, SMALL(IF($P$3:$P$89=\"○\", ROW($P$3:$P$89)-ROW($P$3)+1), ROW(D126)), COLUMNS($Q$3:T128)), \"\")","v":""},{"$f":"IFERROR(INDEX($Q$3:$U$89, SMALL(IF($P$3:$P$89=\"○\", ROW($P$3:$P$89)-ROW($P$3)+1), ROW(E126)), COLUMNS($Q$3:U128)), \"\")","v":""}]
[null,null,null,null,null,null,null,null,null,null,null,null,null,null,null,null,{"$f":"IFERROR(INDEX($Q$3:$U$89, SMALL(IF($P$3:$P$89=\"○\", ROW($P$3:$P$89)-ROW($P$3)+1), ROW(A127)), COLUMNS($Q$3:Q129)), \"\")","v":""},{"$f":"IFERROR(INDEX($Q$3:$U$89, SMALL(IF($P$3:$P$89=\"○\", ROW($P$3:$P$89)-ROW($P$3)+1), ROW(B127)), COLUMNS($Q$3:R129)), \"\")","v":""},{"$f":"IFERROR(INDEX($Q$3:$U$89, SMALL(IF($P$3:$P$89=\"○\", ROW($P$3:$P$89)-ROW($P$3)+1), ROW(C127)), COLUMNS($Q$3:S129)), \"\")","v":""},{"$f":"IFERROR(INDEX($Q$3:$U$89, SMALL(IF($P$3:$P$89=\"○\", ROW($P$3:$P$89)-ROW($P$3)+1), ROW(D127)), COLUMNS($Q$3:T129)), \"\")","v":""},{"$f":"IFERROR(INDEX($Q$3:$U$89, SMALL(IF($P$3:$P$89=\"○\", ROW($P$3:$P$89)-ROW($P$3)+1), ROW(E127)), COLUMNS($Q$3:U129)), \"\")","v":""}]
[null,null,null,null,null,null,null,null,null,null,null,null,null,null,null,null,{"$f":"IFERROR(INDEX($Q$3:$U$89, SMALL(IF($P$3:$P$89=\"○\", ROW($P$3:$P$89)-ROW($P$3)+1), ROW(A128)), COLUMNS($Q$3:Q130)), \"\")","v":""},{"$f":"IFERROR(INDEX($Q$3:$U$89, SMALL(IF($P$3:$P$89=\"○\", ROW($P$3:$P$89)-ROW($P$3)+1), ROW(B128)), COLUMNS($Q$3:R130)), \"\")","v":""},{"$f":"IFERROR(INDEX($Q$3:$U$89, SMALL(IF($P$3:$P$89=\"○\", ROW($P$3:$P$89)-ROW($P$3)+1), ROW(C128)), COLUMNS($Q$3:S130)), \"\")","v":""},{"$f":"IFERROR(INDEX($Q$3:$U$89, SMALL(IF($P$3:$P$89=\"○\", ROW($P$3:$P$89)-ROW($P$3)+1), ROW(D128)), COLUMNS($Q$3:T130)), \"\")","v":""},{"$f":"IFERROR(INDEX($Q$3:$U$89, SMALL(IF($P$3:$P$89=\"○\", ROW($P$3:$P$89)-ROW($P$3)+1), ROW(E128)), COLUMNS($Q$3:U130)), \"\")","v":""}]
[null,null,null,null,null,null,null,null,null,null,null,null,null,null,null,null,{"$f":"IFERROR(INDEX($Q$3:$U$89, SMALL(IF($P$3:$P$89=\"○\", ROW($P$3:$P$89)-ROW($P$3)+1), ROW(A129)), COLUMNS($Q$3:Q131)), \"\")","v":""},{"$f":"IFERROR(INDEX($Q$3:$U$89, SMALL(IF($P$3:$P$89=\"○\", ROW($P$3:$P$89)-ROW($P$3)+1), ROW(B129)), COLUMNS($Q$3:R131)), \"\")","v":""},{"$f":"IFERROR(INDEX($Q$3:$U$89, SMALL(IF($P$3:$P$89=\"○\", ROW($P$3:$P$89)-ROW($P$3)+1), ROW(C129)), COLUMNS($Q$3:S131)), \"\")","v":""},{"$f":"IFERROR(INDEX($Q$3:$U$89, SMALL(IF($P$3:$P$89=\"○\", ROW($P$3:$P$89)-ROW($P$3)+1), ROW(D129)), COLUMNS($Q$3:T131)), \"\")","v":""},{"$f":"IFERROR(INDEX($Q$3:$U$89, SMALL(IF($P$3:$P$89=\"○\", ROW($P$3:$P$89)-ROW($P$3)+1), ROW(E129)), COLUMNS($Q$3:U131)), \"\")","v":""}]
[null,null,null,null,null,null,null,null,null,null,null,null,null,null,null,null,{"$f":"IFERROR(INDEX($Q$3:$U$89, SMALL(IF($P$3:$P$89=\"○\", ROW($P$3:$P$89)-ROW($P$3)+1), ROW(A130)), COLUMNS($Q$3:Q132)), \"\")","v":""},{"$f":"IFERROR(INDEX($Q$3:$U$89, SMALL(IF($P$3:$P$89=\"○\", ROW($P$3:$P$89)-ROW($P$3)+1), ROW(B130)), COLUMNS($Q$3:R132)), \"\")","v":""},{"$f":"IFERROR(INDEX($Q$3:$U$89, SMALL(IF($P$3:$P$89=\"○\", ROW($P$3:$P$89)-ROW($P$3)+1), ROW(C130)), COLUMNS($Q$3:S132)), \"\")","v":""},{"$f":"IFERROR(INDEX($Q$3:$U$89, SMALL(IF($P$3:$P$89=\"○\", ROW($P$3:$P$89)-ROW($P$3)+1), ROW(D130)), COLUMNS($Q$3:T132)), \"\")","v":""},{"$f":"IFERROR(INDEX($Q$3:$U$89, SMALL(IF($P$3:$P$89=\"○\", ROW($P$3:$P$89)-ROW($P$3)+1), ROW(E130)), COLUMNS($Q$3:U132)), \"\")","v":""}]
[null,null,null,null,null,null,null,null,null,null,null,null,null,null,null,null,{"$f":"IFERROR(INDEX($Q$3:$U$89, SMALL(IF($P$3:$P$89=\"○\", ROW($P$3:$P$89)-ROW($P$3)+1), ROW(A131)), COLUMNS($Q$3:Q133)), \"\")","v":""},{"$f":"IFERROR(INDEX($Q$3:$U$89, SMALL(IF($P$3:$P$89=\"○\", ROW($P$3:$P$89)-ROW($P$3)+1), ROW(B131)), COLUMNS($Q$3:R133)), \"\")","v":""},{"$f":"IFERROR(INDEX($Q$3:$U$89, SMALL(IF($P$3:$P$89=\"○\", ROW($P$3:$P$89)-ROW($P$3)+1), ROW(C131)), COLUMNS($Q$3:S133)), \"\")","v":""},{"$f":"IFERROR(INDEX($Q$3:$U$89, SMALL(IF($P$3:$P$89=\"○\", ROW($P$3:$P$89)-ROW($P$3)+1), ROW(D131)), COLUMNS($Q$3:T133)), \"\")","v":""},{"$f":"IFERROR(INDEX($Q$3:$U$89, SMALL(IF($P$3:$P$89=\"○\", ROW($P$3:$P$89)-ROW($P$3)+1), ROW(E131)), COLUMNS($Q$3:U133)), \"\")","v":""}]
[null,null,null,null,null,null,null,null,null,null,null,null,null,null,null,null,{"$f":"IFERROR(INDEX($Q$3:$U$89, SMALL(IF($P$3:$P$89=\"○\", ROW($P$3:$P$89)-ROW($P$3)+1), ROW(A132)), COLUMNS($Q$3:Q134)), \"\")","v":""},{"$f":"IFERROR(INDEX($Q$3:$U$89, SMALL(IF($P$3:$P$89=\"○\", ROW($P$3:$P$89)-ROW($P$3)+1), ROW(B132)), COLUMNS($Q$3:R134)), \"\")","v":""},{"$f":"IFERROR(INDEX($Q$3:$U$89, SMALL(IF($P$3:$P$89=\"○\", ROW($P$3:$P$89)-ROW($P$3)+1), ROW(C132)), COLUMNS($Q$3:S134)), \"\")","v":""},{"$f":"IFERROR(INDEX($Q$3:$U$89, SMALL(IF($P$3:$P$89=\"○\", ROW($P$3:$P$89)-ROW($P$3)+1), ROW(D132)), COLUMNS($Q$3:T134)), \"\")","v":""},{"$f":"IFERROR(INDEX($Q$3:$U$89, SMALL(IF($P$3:$P$89=\"○\", ROW($P$3:$P$89)-ROW($P$3)+1), ROW(E132)), COLUMNS($Q$3:U134)), \"\")","v":""}]
[null,null,null,null,null,null,null,null,null,null,null,null,null,null,null,null,{"$f":"IFERROR(INDEX($Q$3:$U$89, SMALL(IF($P$3:$P$89=\"○\", ROW($P$3:$P$89)-ROW($P$3)+1), ROW(A133)), COLUMNS($Q$3:Q135)), \"\")","v":""},{"$f":"IFERROR(INDEX($Q$3:$U$89, SMALL(IF($P$3:$P$89=\"○\", ROW($P$3:$P$89)-ROW($P$3)+1), ROW(B133)), COLUMNS($Q$3:R135)), \"\")","v":""},{"$f":"IFERROR(INDEX($Q$3:$U$89, SMALL(IF($P$3:$P$89=\"○\", ROW($P$3:$P$89)-ROW($P$3)+1), ROW(C133)), COLUMNS($Q$3:S135)), \"\")","v":""},{"$f":"IFERROR(INDEX($Q$3:$U$89, SMALL(IF($P$3:$P$89=\"○\", ROW($P$3:$P$89)-ROW($P$3)+1), ROW(D133)), COLUMNS($Q$3:T135)), \"\")","v":""},{"$f":"IFERROR(INDEX($Q$3:$U$89, SMALL(IF($P$3:$P$89=\"○\", ROW($P$3:$P$89)-ROW($P$3)+1), ROW(E133)), COLUMNS($Q$3:U135)), \"\")","v":""}]
[null,null,null,null,null,null,null,null,null,null,null,null,null,null,null,null,{"$f":"IFERROR(INDEX($Q$3:$U$89, SMALL(IF($P$3:$P$89=\"○\", ROW($P$3:$P$89)-ROW($P$3)+1), ROW(A134)), COLUMNS($Q$3:Q136)), \"\")","v":""},{"$f":"IFERROR(INDEX($Q$3:$U$89, SMALL(IF($P$3:$P$89=\"○\", ROW($P$3:$P$89)-ROW($P$3)+1), ROW(B134)), COLUMNS($Q$3:R136)), \"\")","v":""},{"$f":"IFERROR(INDEX($Q$3:$U$89, SMALL(IF($P$3:$P$89=\"○\", ROW($P$3:$P$89)-ROW($P$3)+1), ROW(C134)), COLUMNS($Q$3:S136)), \"\")","v":""},{"$f":"IFERROR(INDEX($Q$3:$U$89, SMALL(IF($P$3:$P$89=\"○\", ROW($P$3:$P$89)-ROW($P$3)+1), ROW(D134)), COLUMNS($Q$3:T136)), \"\")","v":""},{"$f":"IFERROR(INDEX($Q$3:$U$89, SMALL(IF($P$3:$P$89=\"○\", ROW($P$3:$P$89)-ROW($P$3)+1), ROW(E134)), COLUMNS($Q$3:U136)), \"\")","v":""}]
[null,null,null,null,null,null,null,null,null,null,null,null,null,null,null,null,{"$f":"IFERROR(INDEX($Q$3:$U$89, SMALL(IF($P$3:$P$89=\"○\", ROW($P$3:$P$89)-ROW($P$3)+1), ROW(A135)), COLUMNS($Q$3:Q137)), \"\")","v":""},{"$f":"IFERROR(INDEX($Q$3:$U$89, SMALL(IF($P$3:$P$89=\"○\", ROW($P$3:$P$89)-ROW($P$3)+1), ROW(B135)), COLUMNS($Q$3:R137)), \"\")","v":""},{"$f":"IFERROR(INDEX($Q$3:$U$89, SMALL(IF($P$3:$P$89=\"○\", ROW($P$3:$P$89)-ROW($P$3)+1), ROW(C135)), COLUMNS($Q$3:S137)), \"\")","v":""},{"$f":"IFERROR(INDEX($Q$3:$U$89, SMALL(IF($P$3:$P$89=\"○\", ROW($P$3:$P$89)-ROW($P$3)+1), ROW(D135)), COLUMNS($Q$3:T137)), \"\")","v":""},{"$f":"IFERROR(INDEX($Q$3:$U$89, SMALL(IF($P$3:$P$89=\"○\", ROW($P$3:$P$89)-ROW($P$3)+1), ROW(E135)), COLUMNS($Q$3:U137)), \"\")","v":""}]
[null,null,null,null,null,null,null,null,null,null,null,null,null,null,null,null,{"$f":"IFERROR(INDEX($Q$3:$U$89, SMALL(IF($P$3:$P$89=\"○\", ROW($P$3:$P$89)-ROW($P$3)+1), ROW(A136)), COLUMNS($Q$3:Q138)), \"\")","v":""},{"$f":"IFERROR(INDEX($Q$3:$U$89, SMALL(IF($P$3:$P$89=\"○\", ROW($P$3:$P$89)-ROW($P$3)+1), ROW(B136)), COLUMNS($Q$3:R138)), \"\")","v":""},{"$f":"IFERROR(INDEX($Q$3:$U$89, SMALL(IF($P$3:$P$89=\"○\", ROW($P$3:$P$89)-ROW($P$3)+1), ROW(C136)), COLUMNS($Q$3:S138)), \"\")","v":""},{"$f":"IFERROR(INDEX($Q$3:$U$89, SMALL(IF($P$3:$P$89=\"○\", ROW($P$3:$P$89)-ROW($P$3)+1), ROW(D136)), COLUMNS($Q$3:T138)), \"\")","v":""},{"$f":"IFERROR(INDEX($Q$3:$U$89, SMALL(IF($P$3:$P$89=\"○\", ROW($P$3:$P$89)-ROW($P$3)+1), ROW(E136)), COLUMNS($Q$3:U138)), \"\")","v":""}]
[null,null,null,null,null,null,null,null,null,null,null,null,null,null,null,null,{"$f":"IFERROR(INDEX($Q$3:$U$89, SMALL(IF($P$3:$P$89=\"○\", ROW($P$3:$P$89)-ROW($P$3)+1), ROW(A137)), COLUMNS($Q$3:Q139)), \"\")","v":""},{"$f":"IFERROR(INDEX($Q$3:$U$89, SMALL(IF($P$3:$P$89=\"○\", ROW($P$3:$P$89)-ROW($P$3)+1), ROW(B137)), COLUMNS($Q$3:R139)), \"\")","v":""},{"$f":"IFERROR(INDEX($Q$3:$U$89, SMALL(IF($P$3:$P$89=\"○\", ROW($P$3:$P$89)-ROW($P$3)+1), ROW(C137)), COLUMNS($Q$3:S139)), \"\")","v":""},{"$f":"IFERROR(INDEX($Q$3:$U$89, SMALL(IF($P$3:$P$89=\"○\", ROW($P$3:$P$89)-ROW($P$3)+1), ROW(D137)), COLUMNS($Q$3:T139)), \"\")","v":""},{"$f":"IFERROR(INDEX($Q$3:$U$89, SMALL(IF($P$3:$P$89=\"○\", ROW($P$3:$P$89)-ROW($P$3)+1), ROW(E137)), COLUMNS($Q$3:U139)), \"\")","v":""}]
[null,null,null,null,null,null,null,null,null,null,null,null,null,null,null,null,{"$f":"IFERROR(INDEX($Q$3:$U$89, SMALL(IF($P$3:$P$89=\"○\", ROW($P$3:$P$89)-ROW($P$3)+1), ROW(A138)), COLUMNS($Q$3:Q140)), \"\")","v":""},{"$f":"IFERROR(INDEX($Q$3:$U$89, SMALL(IF($P$3:$P$89=\"○\", ROW($P$3:$P$89)-ROW($P$3)+1), ROW(B138)), COLUMNS($Q$3:R140)), \"\")","v":""},{"$f":"IFERROR(INDEX($Q$3:$U$89, SMALL(IF($P$3:$P$89=\"○\", ROW($P$3:$P$89)-ROW($P$3)+1), ROW(C138)), COLUMNS($Q$3:S140)), \"\")","v":""},{"$f":"IFERROR(INDEX($Q$3:$U$89, SMALL(IF($P$3:$P$89=\"○\", ROW($P$3:$P$89)-ROW($P$3)+1), ROW(D138)), COLUMNS($Q$3:T140)), \"\")","v":""},{"$f":"IFERROR(INDEX($Q$3:$U$89, SMALL(IF($P$3:$P$89=\"○\", ROW($P$3:$P$89)-ROW($P$3)+1), ROW(E138)), COLUMNS($Q$3:U140)), \"\")","v":""}]
[null,null,null,null,null,null,null,null,null,null,null,null,null,null,null,null,{"$f":"IFERROR(INDEX($Q$3:$U$89, SMALL(IF($P$3:$P$89=\"○\", ROW($P$3:$P$89)-ROW($P$3)+1), ROW(A139)), COLUMNS($Q$3:Q141)), \"\")","v":""},{"$f":"IFERROR(INDEX($Q$3:$U$89, SMALL(IF($P$3:$P$89=\"○\", ROW($P$3:$P$89)-ROW($P$3)+1), ROW(B139)), COLUMNS($Q$3:R141)), \"\")","v":""},{"$f":"IFERROR(INDEX($Q$3:$U$89, SMALL(IF($P$3:$P$89=\"○\", ROW($P$3:$P$89)-ROW($P$3)+1), ROW(C139)), COLUMNS($Q$3:S141)), \"\")","v":""},{"$f":"IFERROR(INDEX($Q$3:$U$89, SMALL(IF($P$3:$P$89=\"○\", ROW($P$3:$P$89)-ROW($P$3)+1), ROW(D139)), COLUMNS($Q$3:T141)), \"\")","v":""},{"$f":"IFERROR(INDEX($Q$3:$U$89, SMALL(IF($P$3:$P$89=\"○\", ROW($P$3:$P$89)-ROW($P$3)+1), ROW(E139)), COLUMNS($Q$3:U141)), \"\")","v":""}]
[null,null,null,null,null,null,null,null,null,null,null,null,null,null,null,null,{"$f":"IFERROR(INDEX($Q$3:$U$89, SMALL(IF($P$3:$P$89=\"○\", ROW($P$3:$P$89)-ROW($P$3)+1), ROW(A140)), COLUMNS($Q$3:Q142)), \"\")","v":""},{"$f":"IFERROR(INDEX($Q$3:$U$89, SMALL(IF($P$3:$P$89=\"○\", ROW($P$3:$P$89)-ROW($P$3)+1), ROW(B140)), COLUMNS($Q$3:R142)), \"\")","v":""},{"$f":"IFERROR(INDEX($Q$3:$U$89, SMALL(IF($P$3:$P$89=\"○\", ROW($P$3:$P$89)-ROW($P$3)+1), ROW(C140)), COLUMNS($Q$3:S142)), \"\")","v":""},{"$f":"IFERROR(INDEX($Q$3:$U$89, SMALL(IF($P$3:$P$89=\"○\", ROW($P$3:$P$89)-ROW($P$3)+1), ROW(D140)), COLUMNS($Q$3:T142)), \"\")","v":""},{"$f":"IFERROR(INDEX($Q$3:$U$89, SMALL(IF($P$3:$P$89=\"○\", ROW($P$3:$P$89)-ROW($P$3)+1), ROW(E140)), COLUMNS($Q$3:U142)), \"\")","v":""}]
[null,null,null,null,null,null,null,null,null,null,null,null,null,null,null,null,{"$f":"IFERROR(INDEX($Q$3:$U$89, SMALL(IF($P$3:$P$89=\"○\", ROW($P$3:$P$89)-ROW($P$3)+1), ROW(A141)), COLUMNS($Q$3:Q143)), \"\")","v":""},{"$f":"IFERROR(INDEX($Q$3:$U$89, SMALL(IF($P$3:$P$89=\"○\", ROW($P$3:$P$89)-ROW($P$3)+1), ROW(B141)), COLUMNS($Q$3:R143)), \"\")","v":""},{"$f":"IFERROR(INDEX($Q$3:$U$89, SMALL(IF($P$3:$P$89=\"○\", ROW($P$3:$P$89)-ROW($P$3)+1), ROW(C141)), COLUMNS($Q$3:S143)), \"\")","v":""},{"$f":"IFERROR(INDEX($Q$3:$U$89, SMALL(IF($P$3:$P$89=\"○\", ROW($P$3:$P$89)-ROW($P$3)+1), ROW(D141)), COLUMNS($Q$3:T143)), \"\")","v":""},{"$f":"IFERROR(INDEX($Q$3:$U$89, SMALL(IF($P$3:$P$89=\"○\", ROW($P$3:$P$89)-ROW($P$3)+1), ROW(E141)), COLUMNS($Q$3:U143)), \"\")","v":""}]

{"sheet":"【取組番号早見表】","index":10,"n_rows":108,"n_cols":4,"rows_kept":108,"cut":false,"hidden":false,"merged":[[10,0,10,1],[0,0,0,3],[30,0,30,1],[31,0,37,1],[7,0,7,1],[11,0,24,0],[19,1,21,1],[8,0,9,0],[11,1,14,1],[22,1,26,1],[15,1,18,1],[42,0,42,1],[43,1,46,1],[57,3,58,3],[43,0,47,0],[48,0,48,1],[53,1,54,1],[49,1,50,1],[49,0,54,0],[59,0,63,0],[57,0,57,1],[57,2,58,2],[64,0,76,0],[64,1,66,1],[67,1,69,1],[74,1,75,1],[70,1,73,1],[105,1,107,1],[97,0,107,0],[77,0,77,1],[80,0,80,1],[95,3,96,3],[97,1,98,1],[101,1,102,1],[103,1,104,1],[95,0,95,1],[95,2,96,2],[81,0,91,1]]}
["取組番号早見表"]
[null,null,null,"取組番号"]
[null,null,"事務処理",200]
[null,null,"会議など",300]
["【農地維持活動】"]
[]
["1．地域資源の基礎的な保全活動"]
["活動項目",null,"取組","取組番号"]
["点検・計画策定","点検","点検",1]
[null,"計画策定","年度活動計画の策定",2]
["研修",null,"事務・組織運営等に関する研修、機械の安全使用に関する研修",3]
["実践活動","農用地","遊休農地発生防止のための保全管理",4]
[null,null,"畦畔・法面・防風林の草刈り",5]
[null,null,"鳥獣害防護柵等の保守管理",6]
[null,null,"農用地進入路の適正管理",100]
[null,"水路","水路の草刈り",7]
[null,null,"水路の泥上げ",8]
[null,null,"水路附帯施設の保守管理",9]
[null,null,"配水操作",101]
[null,"農道","農道の草刈り",10]
[null,null,"農道側溝の泥上げ",11]
[null,null,"路面の維持",12]
[null,"ため池","ため池の草刈り",13]
[null,null,"ため池の泥上げ",14]
[null,null,"ため池附帯施設の保守管理",15]
[null,null,"配水操作",102]
[null,null,"鳥獣害防護柵の適正管理",103]
[null,"共通","異常気象時の対応",16]
[]
["２．地域資源の適切な保全管理のための推進活動"]
["活動項目",null,"取組","取組番号"]
["地域資源の適切な保全管理のための推進活動",null,"農業者の検討会の開催",17]
[null,null,"農業者に対する意向調査、現地調査",18]
[null,null,"不在村地主との連絡体制の整備等",19]
[null,null,"集落外住民や地域住民との意見交換等",20]
[null,null,"地域住民等に対する意向調査等",21]
[null,null,"有識者等による研修会、検討会の開催",22]
[null,null,"その他",23]
[]
["【資源向上活動（地域資源の質的向上を図る共同活動）】"]
[]
["１．施設の軽微な補修"]
["活動項目",null,"取組","取組番号"]
["機能診断・計画策定","機能診断","農用地の機能診断",24]
[null,null,"水路の機能診断",25]
[null,null,"農道の機能診断",26]
[null,null,"ため池の機能診断",27]
[null,"計画策定","年度活動計画の策定",28]
["研修",null,"機能診断・補修技術等に関する研修",29]
["実践活動","農用地","農用地の軽微な補修等",30]
[null,null,"農用地進入路の補修",104]
[null,"水路","水路の軽微な補修等",31]
[null,"農道","農道の軽微な補修等",32]
[null,"ため池","ため池の軽微な補修等",33]
[null,null,"鳥獣害防護柵の補修・設置",105]
[]
["２．農村環境保全活動"]
["活動項目",null,"取組","取組番号"]
[null,"テーマ"]
["計画策定","生態系保全","生物多様性保全計画の策定",34]
[null,"水質保全","水質保全計画、農地保全計画の策定",35]
[null,"景観形成・生活環境保全","景観形成計画、生活環境保全計画の策定",36]
[null,"水田貯留機能増進・地下水かん養","水田貯留機能増進計画、地下水かん養活動計画の策定",37]
[null,"資源循環","資源循環計画の策定",38]
["実践活動","生態系保全","生物の生息状況の把握",39]
[null,null,"外来種の駆除",40]
[null,null,"その他（生態系保全）",41]
[null,"水質保全","水質モニタリングの実施・記録管理",42]
[null,null,"畑からの土砂流出対策",43]
[null,null,"その他（水質保全）",44]
[null,"景観形成・生活環境保全","植栽等の景観形成活動",45]
[null,null,"施設等の定期的な巡回点検・清掃",46]
[null,null,"その他（景観形成・生活環境保全）",47]
[null,null,"水質保全を図る施設の適正管理",106]
[null,"水田貯留機能増進・地下水かん養","水田の貯留機能向上活動",48]
[null,null,"水田の地下水かん養機能向上活動、水源かん養林の保全",49]
[null,"資源循環","地域資源の活用・資源循環活動",50]
["啓発・普及",null,"啓発・普及活動",51]
[]
["３．多面的機能の増進を図る活動"]
["活動項目",null,"取組","取組番号"]
["多面的機能の増進を図る活動",null,"遊休農地の有効活用",52]
[null,null,"鳥獣被害防止対策及び環境改善活動の強化",53]
[null,null,"地域住民による直営施工",54]
[null,null,"防災・減災力の強化",55]
[null,null,"農村環境保全活動の幅広い展開",56]
[null,null,"やすらぎ・福祉及び教育機能の活用",57]
[null,null,"農村文化の伝承を通じた農村コミュニティの強化",58]
[null,null,"広域活動組織における活動支援班による活動の実施","58-2"]
[null,null,"水管理を通じた環境負荷低減活動の強化","58-3"]
[null,null,"都道府県、市町村が特に認める活動",59]
[null,null,"広報活動・農的関係人口の拡大",60]
[]
["【資源向上活動（施設の長寿命化のための活動）】"]
[]
["活動項目",null,"取組","取組番号"]
[null,"施設区分"]
["実践活動","水路","水路の補修",61]
[null,null,"水路の更新等",62]
[null,null,"水路法面の補修",107]
[null,null,"取水施設の補修",108]
[null,"農道","農道の補修",63]
[null,null,"農道の更新等",64]
[null,"ため池","ため池の補修",65]
[null,null,"ため池（附帯施設）の更新等",66]
[null,"農地に係る施設","農地に係る施設の補修",109]
[null,null,"農地に係る施設の更新等",110]
[null,null,"農用地進入路の更新等",111]

{"sheet":"【活動項目番号表】 ","index":11,"n_rows":205,"n_cols":6,"rows_kept":205,"cut":false,"hidden":false,"merged":[[42,0,48,0],[42,1,48,2],[52,1,52,2],[37,2,38,2],[37,3,38,3],[37,4,38,4],[13,3,14,3],[13,4,14,4],[15,3,16,3],[15,4,16,4],[18,3,19,3],[22,4,24,4],[26,2,28,2],[31,3,34,3],[31,4,34,4],[41,1,41,2],[0,0,0,5],[7,1,7,2],[8,0,38,0],[8,1,10,1],[8,2,9,2],[8,3,9,3],[8,4,9,4],[11,1,11,2],[12,1,38,1],[18,4,19,4],[20,3,21,3],[20,4,21,4],[22,3,24,3],[12,2,17,2],[18,2,25,2],[29,2,36,2],[62,3,64,3],[62,4,64,4],[65,3,71,3],[53,1,61,1],[53,2,60,2],[89,2,96,2],[65,4,71,4],[65,2,72,2],[53,3,54,3],[53,4,54,4],[55,3,56,3],[55,4,56,4],[57,3,58,3],[152,1,152,2],[108,5,109,5],[110,0,149,0],[110,1,116,1],[111,2,112,2],[111,3,112,3],[111,4,112,4],[128,3,132,3],[128,4,132,4],[134,2,139,2],[134,3,135,3],[114,3,115,3],[114,4,115,4],[117,2,123,2],[119,3,123,3],[119,4,123,4],[140,2,142,2],[141,3,142,3],[141,4,142,4],[144,1,149,2],[144,3,149,3],[144,4,149,4],[117,1,143,1],[125,3,127,3],[125,4,127,4],[73,2,88,2],[108,0,109,0],[108,1,108,2],[108,3,109,3],[108,4,109,4],[134,4,135,4],[137,3,139,3],[137,4,139,4],[114,2,115,2],[97,2,105,2],[65,1,105,1],[53,0,105,0],[124,2,133,2],[57,4,58,4],[73,3,88,3],[73,4,88,4],[89,3,96,3],[89,4,96,4],[97,3,104,3],[97,4,104,4],[59,3,60,3],[59,4,60,4],[62,1,64,2],[153,0,163,0],[153,1,163,2],[182,4,184,4],[185,3,187,3],[185,4,187,4],[188,2,194,2],[188,3,192,3],[188,4,192,4],[193,3,194,3],[193,4,194,4],[167,4,168,4],[167,0,168,0],[167,1,167,2],[167,3,168,3],[195,3,197,3],[195,4,197,4],[198,3,200,3],[198,4,200,4],[195,2,201,2],[169,1,201,1],[169,0,201,0],[167,5,168,5],[169,2,181,2],[169,3,175,3],[169,4,175,4],[178,3,181,3],[178,4,181,4],[182,2,187,2],[182,3,184,3]]}
["活動項目番号表"]
[]
[null,null,null,null,"活動項目番号"]
[null,null,null,"事務処理",200]
[null,null,null,"会議など",300]
["【農地維持活動】"]
["（地域資源の基礎的な保全活動）"]
["支払区分","活動区分",null,"活動項目","活動項目番号","取組の内容（平成30年度までの取組名）"]
["１（農地維持）","点検・\n計画\n策定","点検","点検",1,"遊休農地等の発生状況の把握"]
[null,null,null,null,null,"施設の点検（水路、農道、ため池）"]
[null,null,"計画策定","年度活動計画の策定",2,"年度活動計画の策定"]
[null,"研修",null,"事務・組織運営等に関する研修、\n機械の安全使用に関する研修",3,"活動に関する事務（書類作成、申請手続き等）や組織の運営に関する研修"]
[null,"実践活動","農用地","遊休農地発生防止の\nための保全管理",4,"遊休農地発生防止のための保全管理"]
[null,null,null,"畦畔・法面・防風林の\n草刈り",5,"畦畔・農用地法面等の草刈り"]
[null,null,null,null,null,"防風林の枝払い・下草の草刈り"]
[null,null,null,"鳥獣害防護柵等の\n保守管理",6,"鳥獣害防護柵の適正管理"]
[null,null,null,null,null,"防風ネットの適正管理"]
[null,null,null,"農用地進入路",100,"農用地進入路の適正管理"]
[null,null,"水路","水路の草刈り",7,"水路の草刈り"]
[null,null,null,null,null,"ポンプ場、調整施設等の草刈り"]
[null,null,null,"水路の泥上げ",8,"水路の泥上げ"]
[null,null,null,null,null,"ポンプ吸水槽等の泥上げ"]
[null,null,null,"水路附帯施設の\n保守管理",9,"かんがい期前の注油"]
[null,null,null,null,null,"ゲート類等の保守管理"]
[null,null,null,null,null,"遮光施設の適正管理"]
[null,null,null,"配水操作",101,"配水操作"]
[null,null,"農道","農道の草刈り",10,"路肩・法面の草刈り"]
[null,null,null,"農道側溝の泥上げ",11,"側溝の泥上げ"]
[null,null,null,"路面の維持",12,"路面の維持"]
[null,null,"ため池","ため池の草刈り",13,"ため池の草刈り"]
[null,null,null,"ため池の泥上げ",14,"ため池の泥上げ"]
[null,null,null,"ため池附帯施設の\n保守管理",15,"かんがい期前の施設の清掃・防塵"]
[null,null,null,null,null,"管理道路の管理"]
[null,null,null,null,null,"遮光施設の適正管理"]
[null,null,null,null,null,"ゲート類の保守管理"]
[null,null,null,"配水操作",102,"配水操作"]
[null,null,null,"鳥獣害防護柵の適正管理",103,"鳥獣害防護柵の適正管理"]
[null,null,"共通","異常気象時の対応",16,"異常気象後の見回り（農用地、水路、農道、ため池）"]
[null,null,null,null,null,"異常気象後の応急措置（農用地、水路、農道、ため池）"]
[]
["（地域資源の適切な保全管理のための推進活動）"]
["支払区分","活動区分",null,"活動項目","活動項目番号","取組の内容（平成30年度までの取組名）"]
["１（農地維持）","推進活動",null,"農業者の検討会の開催",17,"農業者（入り作農家、土地持ち非農家を含む）による検討会の開催"]
[null,null,null,"農業者に対する意向調査、現地調査",18,"農業者に対する意向調査、農業者による現地調査"]
[null,null,null,"不在村地主との連絡体制の整備等",19,"不在村地主との連絡体制の整備、調整、それに必要な調査"]
[null,null,null,"集落外住民や地域住民との意見交換等",20,"地域住民等（集落外の住民・組織等も含む）との意見交換・ワークショップ・交流会の開催"]
[null,null,null,"地域住民等に対する意向調査等",21,"地域住民等に対する意向調査、地域住民等との集落内調査"]
[null,null,null,"有識者等による研修会、検討会の開催",22,"有識者等による研修会、有識者を交えた検討会の開催"]
[null,null,null,"その他",23,"-"]
[]
["【資源向上活動（地域資源の質的向上を図る共同活動）】"]
["（施設の軽微な補修）"]
["支払区分","活動区分",null,"活動項目","活動項目番号","取組の内容（平成30年度までの取組名）"]
["２（資源向上）","機能診断・\n計画策定","機能診断","農用地の機能診断",24,"施設の機能診断（農用地）"]
[null,null,null,null,null,"診断結果の記録管理（農用地）"]
[null,null,null,"水路の機能診断",25,"施設の機能診断（水路）"]
[null,null,null,null,null,"診断結果の記録管理（水路）"]
[null,null,null,"農道の機能診断",26,"施設の機能診断（農道）"]
[null,null,null,null,null,"診断結果の記録管理（農道）"]
[null,null,null,"ため池の機能診断",27,"施設の機能診断（ため池）"]
[null,null,null,null,null,"診断結果の記録管理（ため池）"]
[null,null,"計画策定","年度活動計画の策定",28,"年度活動計画の策定"]
[null,"研修",null,"機能診断・補修技術等に関する研修",29,"対象組織による自主的な機能診断及び簡単な補修に関する研修"]
[null,null,null,null,null,"老朽化が進む施設の長寿命化のための補修、更新等に関する研修"]
[null,null,null,null,null,"農業用水の保全、農地の保全や地域環境の保全に資する\n新たな施設の設置等に関する研修"]
[null,"実践活動","農用地","農用地の軽微な補修等",30,"畦畔の再構築"]
[null,null,null,null,null,"農用地法面の初期補修"]
[null,null,null,null,null,"暗渠施設の清掃"]
[null,null,null,null,null,"農用地の除れき"]
[null,null,null,null,null,"鳥獣害防護柵の補修・設置"]
[null,null,null,null,null,"防風ネットの補修・設置"]
[null,null,null,null,null,"きめ細やかな雑草対策"]
[null,null,null,"農用地進入路の補修",104,"農用地進入路の補修"]
[null,null,"水路","水路の軽微な補修等",31,"水路側壁のはらみ修正"]
[null,null,null,null,null,"目地詰め"]
[null,null,null,null,null,"表面劣化に対するコーティング等"]
[null,null,null,null,null,"不同沈下に対する早期対応"]
[null,null,null,null,null,"側壁の裏込材の充填、水路耕畔の補修"]
[null,null,null,null,null,"水路に付着した藻等の除去"]
[null,null,null,null,null,"水路法面の初期補修"]
[null,null,null,null,null,"破損施設の補修（水路）"]
[null,null,null,null,null,"きめ細やかな雑草対策（水路）"]
[null,null,null,null,null,"パイプラインの破損施設の補修"]
[null,null,null,null,null,"パイプ内の清掃"]
[null,null,null,null,null,"給水栓ボックス基礎部の補強"]
[null,null,null,null,null,"破損施設の補修（水路の附帯施設）"]
[null,null,null,null,null,"給水栓に対する凍結防止対策"]
[null,null,null,null,null,"空気弁等への腐食防止剤の塗布等"]
[null,null,null,null,null,"遮光施設の補修等"]
[null,null,"農道","農道の軽微な補修等",32,"路肩、法面の初期補修"]
[null,null,null,null,null,"軌道等の運搬施設の維持補修"]
[null,null,null,null,null,"破損施設の補修（農道）"]
[null,null,null,null,null,"きめ細やかな雑草対策（農道）"]
[null,null,null,null,null,"側溝の目地詰め"]
[null,null,null,null,null,"側溝の不同沈下への早期対応"]
[null,null,null,null,null,"側溝の裏込材の充填"]
[null,null,null,null,null,"破損施設の補修（農道の附帯施設）"]
[null,null,"ため池","ため池の軽微な補修等",33,"遮水シートの補修"]
[null,null,null,null,null,"コンクリート構造物の目地詰め"]
[null,null,null,null,null,"コンクリート構造物の表面劣化への対応"]
[null,null,null,null,null,"堤体侵食の早期補修"]
[null,null,null,null,null,"破損施設の補修（ため池の堤体）"]
[null,null,null,null,null,"きめ細やかな雑草対策（ため池の堤体）"]
[null,null,null,null,null,"破損施設の補修（ため池の附帯施設）"]
[null,null,null,null,null,"遮光施設の補修等"]
[null,null,null,"鳥獣害防護柵の補修・設置",105,"鳥獣害防護柵の補修・設置"]
[]
["（農村環境保全活動）"]
["支払区分","活動区分",null,"活動項目","活動項目番号","取組の内容（平成30年度までの取組名）"]
[null,null,"テーマ"]
["２（資源向上）","計画策定","生態系保全","生物多様性保全計画の策定",34,"生物多様性保全計画の策定"]
[null,null,"水質保全","水質保全計画、農地保全計画の策定",35,"水質保全計画の策定"]
[null,null,null,null,null,"農地の保全に係る計画の策定"]
[null,null,"景観形成・\n生活環境保全","景観形成計画、\n生活環境保全計画の策定",36,"景観形成、生活環境保全計画の策定"]
[null,null,"水田貯留機能増進・\n地下水かん養","水田貯留機能増進計画、\n地下水かん養活動計画の策定",37,"水田貯留機能増進に係る地域計画の策定"]
[null,null,null,null,null,"地下水かん養に係る地域計画の策定"]
[null,null,"資源循環","資源循環計画の策定",38,"資源循環に係る地域計画の策定"]
[null,"実践活動","生態系保全","生物の生息状況の把握",39,"生物の生息状況の把握"]
[null,null,null,"外来種の駆除",40,"外来種の駆除"]
[null,null,null,"その他（生態系保全）",41,"生物多様性保全に配慮した施設の適正管理"]
[null,null,null,null,null,"水田を活用した生息環境の提供"]
[null,null,null,null,null,"生物の生活史を考慮した適正管理"]
[null,null,null,null,null,"放流・植栽を通じた在来生物の育成"]
[null,null,null,null,null,"希少種の監視"]
[null,null,"水質保全","水質モニタリングの実施・記録管理",42,"水質モニタリングの実施・記録管理"]
[null,null,null,"畑からの土砂流出対策",43,"排水路沿いの林地帯等の適正管理"]
[null,null,null,null,null,"沈砂池の適正管理"]
[null,null,null,null,null,"土壌流出防止のためのグリーンベルト等の適正管理"]
[null,null,null,"その他（水質保全）",44,"水質保全を考慮した施設の適正管理"]
[null,null,null,null,null,"水田からの排水（濁水）管理"]
[null,null,null,null,null,"循環かんがいの実施"]
[null,null,null,null,null,"非かんがい期における通水"]
[null,null,null,null,null,"管理作業の省力化による水資源の保全"]
[null,null,null,"水質の保全を図る施設の適正管理",106,"水質の保全を図る施設の適正管理"]
[null,null,"景観形成・\n生活環境保全","植栽等の景観形成活動",45,"景観形成のための施設への植栽等"]
[null,null,null,null,null,"農用地等を活用した景観形成活動"]
[null,null,null,"施設等の定期的な巡回点検・清掃",46,"施設等の定期的な巡回点検・清掃"]
[null,null,null,"その他（景観形成・生活環境保全）",47,"農業用水の地域用水としての利用・管理"]
[null,null,null,null,null,"伝統的施設や農法の保全・実施"]
[null,null,null,null,null,"農用地からの風塵の防止活動"]
[null,null,"水田貯留機能増進・\n地下水かん養","水田の貯留機能向上活動",48,"水田の貯留機能向上活動"]
[null,null,null,"水田の地下水かん養機能向上活動、\n水源かん養林の保全",49,"水田の地下水かん養機能向上活動"]
[null,null,null,null,null,"水源かん養林の保全"]
[null,null,"資源循環","地域資源の活用・資源循環活動",50,"地域資源の活用・資源循環のための活動"]
[null,"啓発・普及",null,"啓発・普及活動",51,"広報活動"]
[null,null,null,null,null,"啓発活動"]
[null,null,null,null,null,"地域住民等との交流活動"]
[null,null,null,null,null,"学校教育等との連携"]
[null,null,null,null,null,"行政機関等との連携"]
[null,null,null,null,null,"地域内の規制等の取り決め"]
[]
["（多面的機能の増進を図る活動）"]
["支払区分","活動区分",null,"活動項目","活動項目番号","取組の内容（平成30年度までの取組名）"]
["２（資源向上）","増進活動",null,"遊休農地の有効活用",52,"遊休農地の有効活用"]
[null,null,null,"鳥獣被害防止対策及び環境改善活動の強化",53,"農地周りの共同活動の強化"]
[null,null,null,"地域住民による直営施工",54,"地域住民による直営施工"]
[null,null,null,"防災・減災力の強化",55,"防災・減災力の強化"]
[null,null,null,"農村環境保全活動の幅広い展開",56,"農村環境保全活動の幅広い展開"]
[null,null,null,"やすらぎ・福祉及び教育機能の活用",57,"医療・福祉との連携"]
[null,null,null,"農村文化の伝承を通じた\n農村コミュニティの強化",58,"農村文化の伝承を通じた農村コミュニティの強化"]
[null,null,null,"広域活動組織における活動支援班による活動の実施","58-2","-"]
[null,null,null,"水管理を通じた環境負荷低減活動の強化","58-3","-"]
[null,null,null,"都道府県、市町村が特に認める活動",59,"都道府県、市町村が特に認める活動"]
[null,null,null,"広報活動・農村関係人口の拡大",60,"広報活動"]
[]
["【資源向上活動（施設の長寿命化のための活動）】"]
[]
["支払区分","活動区分",null,"活動項目","活動項目番号","取組の内容（平成30年度までの取組名）"]
[null,null,"テーマ"]
["３（長寿命化）","実践活動","水路","水路の補修",61,"水路の破損部分の補修"]
[null,null,null,null,null,"水路の老朽化部分の補修"]
[null,null,null,null,null,"水路側壁の嵩上げ"]
[null,null,null,null,null,"U字フリューム等既設水路の再布設"]
[null,null,null,null,null,"集水枡、分水枡の補修"]
[null,null,null,null,null,"ゲート、ポンプの補修"]
[null,null,null,null,null,"安全施設の補修"]
[null,null,null,"水路法面の補修",107,"水路法面の補修"]
[null,null,null,"取水施設の補修",108,"取水施設の補修"]
[null,null,null,"水路の更新等",62,"素掘り水路からコンクリート水路への更新"]
[null,null,null,null,null,"水路の更新"]
[null,null,null,null,null,"ゲート、ポンプの更新"]
[null,null,null,null,null,"安全施設の設置"]
[null,null,"農道","農道の補修",63,"農道路肩、農道法面の補修"]
[null,null,null,null,null,"舗装の打換え（一部）"]
[null,null,null,null,null,"農道側溝の補修"]
[null,null,null,"農道の更新等",64,"未舗装農道を舗装（砂利、コンクリート、アスファルト）"]
[null,null,null,null,null,"側溝蓋の設置"]
[null,null,null,null,null,"土側溝をコンクリート側溝に更新"]
[null,null,"ため池","ため池の補修",65,"洗掘箇所の補修"]
[null,null,null,null,null,"漏水箇所の補修"]
[null,null,null,null,null,"取水施設の補修"]
[null,null,null,null,null,"洪水吐の補修"]
[null,null,null,null,null,"安全施設の補修"]
[null,null,null,"ため池（附帯施設）の更新等",66,"ゲート・バルブの更新"]
[null,null,null,null,null,"安全施設の設置"]
[null,null,"農地に係る施設","農地に係る施設の補修",109,"暗渠排水の補修"]
[null,null,null,null,null,"給水栓の補修"]
[null,null,null,null,null,"排水桝の補修"]
[null,null,null,"農地に係る施設の更新等",110,"暗渠排水の更新"]
[null,null,null,null,null,"給水栓の更新"]
[null,null,null,null,null,"排水桝の更新"]
[null,null,null,"農用地進入路の更新等",111,"農用地進入路の更新等"]
[]
[]
["※　都道府県において、要綱基本方針で追加する取組については、取組番号100番台を用いて、上の表に追加すること。"]